{"text_format":"3","workbook":"xlsx","n_sheets":6,"sheets":["HOME","CARDANO","GUYAN","CALC","2DOF","ANIMATION"],"not_rendered":{"charts":5,"images":22,"macros":1},"read":"whole","date_system":"1900"}

{"sheet":"HOME","index":0,"n_rows":65,"n_cols":45,"rows_kept":65,"merged":[[1,1,1,3],[1,4,1,5],[1,6,1,8],[1,11,1,13],[2,4,2,5],[2,6,2,7],[2,8,2,9],[2,11,2,13],[2,18,2,19],[2,23,3,24],[3,1,3,2],[3,11,3,13],[3,18,3,19],[4,1,4,2],[4,11,4,13],[4,18,6,19],[4,20,5,21],[4,23,5,25],[5,1,5,2],[5,11,5,13],[6,1,6,2],[6,11,6,13],[7,1,7,2],[7,11,7,13],[8,1,8,2],[8,11,8,13],[9,1,9,2],[9,11,9,13],[10,1,10,2],[10,11,10,13],[10,19,10,20],[12,2,13,3],[12,4,13,4],[12,5,13,5],[12,10,13,11],[12,12,13,12],[12,13,13,13],[12,18,13,19],[12,20,13,20],[12,21,13,21],[12,26,12,28],[13,26,15,28],[14,3,14,7],[14,12,14,16],[14,21,14,25],[34,1,37,1],[36,2,37,3],[36,4,37,4],[36,5,37,5],[36,7,37,7],[36,8,37,9],[36,10,37,11],[36,12,37,12],[36,13,37,13],[36,15,37,15],[36,16,37,17],[36,18,37,19],[36,20,37,20],[36,21,37,21],[36,23,37,23],[36,24,37,25],[39,1,39,7],[39,9,39,28],[40,1,40,3],[40,5,40,6],[40,15,40,16],[40,18,42,18],[41,15,42,15],[41,16,42,16],[41,21,42,22],[41,23,42,24],[41,25,42,26],[41,27,42,28],[52,1,52,3],[52,5,52,6],[64,1,64,3],[64,5,64,6]]}
[{"$nulls":34},0,30000,null,null,1,1E-4,{"$f":"AN1*10000","v":1},null,"chosen:"]
[null,"SYSTEM SETTINGS",null,null,"Global SB Change:",null,0.1,{"$nulls":4},"ANIMATION SETTINGS",null,null,1,2,3,null,"ANALYSIS SETTINGS",{"$nulls":4},"GUYAN CONDENSATION",{"$nulls":10},0,30000,null,null,2,0.0002,{"$f":"AN2*10000","v":2},null,10,{"$f":"VLOOKUP(AQ2,AM1:AN25,2)","v":0.1},{"$f":"VLOOKUP(AQ2,AM1:AO25,3)","v":1000}]
[{"$nulls":4},1,null,2,null,3,null,null,"shaft left from spring [m]",null,null,5,5,5,null,"TYPE:",{"$nulls":4},{"$f":"IF(AJ50=1,\"ON\",\"OFF\")","v":"OFF"},{"$nulls":10},0,30000,null,null,3,0.0005,5]
[null,"mass",null,"m [kg]",5,null,3,null,2,null,null,"shaft right from spring [m]",null,null,5,5,5,null,"SOLVER:",{"$nulls":19},4,1E-3,10,null,50000,30000,20000]
[null,"damping",null,"k [Ns/m]",0.1,null,0.3,null,0.2,null,null,"spring number of turns",null,null,10,10,10,null,"TIMESTEP [SEC]:",null,0.1,null,null,"MASTER DOFS:",{"$nulls":10},{"$f":"CALC!E36+HOME!AJ13+30000","v":29967.0770978222},{"$f":"CALC!E36+HOME!AK13+30000","v":30047.0770978222},30007.0770978222,null,5,2E-3,20,null,1000,3000,2000]
[null,"spring rate",null,"c [m/N]",20,null,50,null,40,null,null,"spring shape",null,null,0.2,0.2,0.2,{"$nulls":17},{"$f":"CALC!E37+HOME!AJ14+30000","v":29980.538905190773},{"$f":"CALC!E37+HOME!AK14+30000","v":30060.538905190773},30013,null,6,0.005,50,null,200000,500000,400000]
[null,"excitation force",null,"F [N]",20,null,10,null,30,null,null,"diameter of springs [m]",null,null,2,2,2,{"$nulls":17},{"$f":"CALC!E38+HOME!AJ15+30000","v":29996.596694100124},{"$f":"CALC!E38+HOME!AK15+30000","v":30076.596694100124},30036.596694100124,null,7,0.01,100,null,200000,100000,300000]
[null,"ang. freqvency",null,"ω [rad/s]",0.5,null,2,null,1,null,null,"position of springs [m]",null,null,4.5,4.5,4.5,{"$nulls":21},8,0.02,200,null,5000,20000,10000]
[null,"initial angle",null,"ε [rad]",-1,null,1.5,null,0.6,null,null,"wagons width [m]",null,null,20,20,20,{"$nulls":21},9,0.05,500,null,-10000,15000,6000]
[null,"initial position",null,"x0 [m]",-10,null,15,null,-5,null,null,"wagons bottom [m]",null,null,1.5,1.5,1.5,{"$nulls":17},"ANALYTIC","RK4",null,null,10,0.1,1000,null,-100000,150000,-50000]
[null,"initial velocity",null,"v0 [m/s]",-5,null,0,null,0,null,null,"wagons top [m]",null,null,8,8,8,null,"t=",{"$f":"IF(CALC!C1=1,CALC!Z4,CALC!BU3)","v":0},null,"S",{"$nulls":12},"RK4",{"$nulls":3},11,0.2,2000,null,-50000,0,0]
[{"$nulls":35},"min","max",null,12,0.5,5000]
[null,"JOLT",{"$f":"IF(CALC!B36=0,\"RELEASED\",\"GRABBED\")","v":"RELEASED"},null,"AMP",40,null,"neut.pos","rel.pos","abs.pos",{"$f":"IF(CALC!B37=0,\"RELEASED\",\"GRABBED\")","v":"RELEASED"},null,"AMP",40,null,"neut.pos","rel.pos","abs.pos",{"$f":"IF(CALC!B38=0,\"RELEASED\",\"GRABBED\")","v":"RELEASED"},null,"AMP",40,null,"neut.pos","rel.pos","abs.pos","GRAB/RELEASE ALL",{"$nulls":7},"sb4",{"$f":"-F13","v":-40},{"$f":"F13","v":40},null,13,1,10000]
[null,"WITH",{"$nulls":5},{"$f":"ANIMATION!$B$81","v":43.99999999999994},{"$f":"ANIMATION!$B$1","v":-10},{"$f":"H14+I14","v":33.99999999999994},{"$nulls":5},{"$f":"ANIMATION!$B$84","v":97.99999999999989},{"$f":"ANIMATION!$B$2","v":15},{"$f":"P14+Q14","v":112.99999999999989},{"$nulls":5},{"$f":"ANIMATION!$B$87","v":151.99999999999983},{"$f":"ANIMATION!$B$3","v":-5},{"$f":"X14+Y14","v":146.99999999999983},{"$f":"IF(CALC!B35=1,\"GRABBED\",\"RELEASED\")","v":"RELEASED"},{"$nulls":7},"sb5",{"$f":"-N13","v":-40},{"$f":"N13","v":40},null,14,2,20000,null,"chosen:"]
[null,"DISPLA-",{"$nulls":32},"sb6",{"$f":"-V13","v":-40},{"$f":"V13","v":40},null,15,5,50000,null,15,{"$f":"VLOOKUP(AQ15,AM1:AN25,2)","v":5},{"$f":"VLOOKUP(AQ15,AM1:AO25,3)","v":50000}]
[null,"CEMENT",{"$nulls":36},16,10,100000]
[{"$nulls":34},"sb1",{"$f":"-F37","v":-8},{"$f":"F37","v":8},null,17,20,200000,null,"x min",0]
[{"$nulls":34},"sb2",{"$f":"-N37","v":-8},{"$f":"N37","v":8},null,18,50,500000,null,"x max",400000]
[{"$nulls":34},"sb3",{"$f":"-V37","v":-8},{"$f":"V37","v":8},null,19,100,1000000,null,"x unit",10000]
[{"$nulls":38},20,200,2000000]
[{"$nulls":34},"amplitudes",{"$nulls":3},21,500,5000000,null,"y min",0]
[{"$nulls":34},"D1",400000,null,null,22,1000,10000000,null,"y max",500000]
[{"$nulls":34},"D2",400000,null,null,23,2000,20000000,null,"y unit",20000]
[{"$nulls":34},"D3",400000,null,null,24,5000,50000000]
[{"$nulls":34},"F1",80000,null,null,25,10000,100000000]
[{"$nulls":34},"F2",80000]
[{"$nulls":34},"F3",80000]
[{"$nulls":34},"timestep",1000]
[]
[{"$nulls":34},"x move",30000,{"$f":"AJ30-30000","v":0}]
[{"$nulls":34},"max",{"$f":"MIN(ANIMATION!B136,B34)","v":0}]
[{"$nulls":34},"min",{"$f":"MAX(ANIMATION!B135,C34)","v":200}]
[null,"x min","x max","x unit"]
[null,0,200,20,{"$nulls":30},"x med",40]
[null,"JOLT WITH FORCE",{"$nulls":26},{"$f":"AK30","v":0},{"$nulls":5},"x amp",20]
[{"$nulls":34},"y med",{"$f":"(N41+N42)/2","v":25}]
[null,null,{"$f":"IF($AI$1=0,\"PRE DEFINED\",\"MANUAL\")","v":"PRE DEFINED"},null,"AMP",8,null,"F=",{"$f":"IF(AI1=0,CALC!AA4,CALC!AA3)","v":-16.82941969615793},null,{"$f":"IF($AI$2=0,\"PRE DEFINED\",\"MANUAL\")","v":"PRE DEFINED"},null,"AMP",8,null,"F=",{"$f":"IF(AI2=0,CALC!AB4,CALC!AB3)","v":9.974949866040545},null,{"$f":"IF($AI$3=0,\"PRE DEFINED\",\"MANUAL\")","v":"PRE DEFINED"},null,"AMP",8,null,"F=",{"$f":"IF(AI3=0,CALC!AC4,CALC!AC3)","v":16.93927420185106},{"$nulls":9},"y amp",{"$f":"ABS(N42-AJ36)","v":25}]
[]
[{"$nulls":34},"plot_an"]
[null,"NATURAL FREQUENCIES AND MODES",{"$nulls":7},"DISPLACEMENT IN FUNCZION OF TIME",{"$nulls":24},"plot_rk"]
[null,"1st natural frequency:",null,null,"α1=",{"$f":"CALC!E20","v":0.04893280274602855},null,"rad/s",null,"x min",0,null,"y min",0,null,"SB Change",null,null,"MOVE ON X AXIS",null,null,"PLOTTING SETTINGS"]
[{"$nulls":9},"x max",40,null,"y max",50,null,5,{"$nulls":5},"ANALYTIC:",null,{"$f":"IF(CALC!B41=1,\"YES\",\"NO\")","v":"NO"},null,"RK4:",null,{"$f":"IF(CALC!B40=1,\"YES\",\"NO\")","v":"NO"}]
[{"$nulls":9},"x unit",1,null,"y unit",2,{"$nulls":20},"STATIC","DYNAMIC"]
[{"$nulls":34},"DYNAMIC"]
[]
[{"$nulls":34},"1 and 2","2 and 3"]
[{"$nulls":34},"1 and 3"]
[{"$nulls":34},"2 and 3"]
[]
[{"$nulls":34},"GUYAN:",0]
[]
[]
[null,"2nd natural frequency:",null,null,"α2=",{"$f":"CALC!E21","v":0.11703789765211471},null,"rad/s"]
{"$rows_empty":11}
[null,"3rd natural frequency:",null,null,"α3=",{"$f":"CALC!E22","v":0.15939796525862993},null,"rad/s"]

{"sheet":"CARDANO","index":1,"n_rows":11,"n_cols":7,"rows_kept":11}
["INPUT:",null,null,"CALC:"]
["a",{"$f":"CALC!E15","v":-30},null,"A",{"$f":"(27*B2^2*B4-9*B2*B3^2)/(27*B2^3)","v":-1.324166666666668E-4},"p",{"$f":"-1*(B3/(3*B2))","v":0.013833333333333335}]
["b",{"$f":"CALC!E16","v":1.245},null,"B",{"$f":"(2*B3^3-9*B2*B3*B4+27*B2^2*B5)/(27*B2^3)","v":-1.7935185185185524E-8},"k",{"$f":"-1*(E3/2)","v":8.9675925925927619E-9}]
["c",{"$f":"CALC!E17","v":-0.01325},null,"Δ",{"$f":"(E3/2)^2+(E2/3)^3","v":-8.591279792524034e-14},"g",{"$f":"IF(E4>=0,(E4)^0.5,\"\")","v":""}]
["d",{"$f":"CALC!E18","v":2.4999999999999991E-5},{"$nulls":3},"l",{"$f":"-1*(E2/3)","v":4.4138888888888937E-5}]
[]
["RESULTS:"]
[null,"Re","Im"]
["x1",{"$f":"IF(E4>=0,G2+(G3+G4)^(1/3)+(G3-G4)^(1/3),G2+2*G5^0.5*COS((1/3)*ACOS(G3/G5^(3/2))))","v":0.02540771132859139}]
["x2",{"$f":"IF(E4>=0,G2-(1/2)*((G3+G4)^(1/3)+(G3-G4)^(1/3)),G2+2*G5^0.5*COS((2*PI()/3)+(1/3)*ACOS(G3/G5^(3/2))))","v":0.002394419184581739},{"$f":"IF(E4>=0,((3^0.5)/2)*((G3+G4)^(1/3)-(G3-G4)^(1/3)),\"\")","v":""}]
["x3",{"$f":"IF(E4>=0,G2-(1/2)*((G3+G4)^(1/3)+(G3-G4)^(1/3)),G2+2*G5^0.5*COS((2*PI()/3)-(1/3)*ACOS(G3/G5^(3/2))))","v":0.013697869486826877},{"$f":"IF(E4>=0,-1*((3^0.5)/2)*((G3+G4)^(1/3)-(G3-G4)^(1/3)),\"\")","v":""}]

{"sheet":"GUYAN","index":2,"n_rows":97,"n_cols":34,"rows_kept":97,"merged":[[1,5,2,6],[1,8,2,9],[1,11,2,12]]}
[1,2,3,4,5,6,7,8,9,10,11,12,13,14,15,16,17,18,19,20,21,22,23,24,25,26,27,28,29,30,31,32,33,34]
["master nodes:",null,1,"1 and2",null,1,null,null,2,null,null,3]
[null,null,2,"1 and 3"]
[null,null,3,"2 and 3","M_mm=",{"$f":"B8","v":5},{"$f":"C8","v":0},null,{"$f":"B8","v":5},{"$f":"D8","v":0},null,{"$f":"C9","v":3},{"$f":"D9","v":0}]
[null,"chosen:",1,null,null,{"$f":"B9","v":0},{"$f":"C9","v":3},null,{"$f":"B10","v":0},{"$f":"D10","v":2},null,{"$f":"C10","v":0},{"$f":"D10","v":2}]
[]
["INPUT",{"$nulls":3},"M_ss=",{"$f":"D10","v":2},null,null,{"$f":"C9","v":3},null,null,{"$f":"B8","v":5}]
[null,{"$f":"CALC!E2","v":5},{"$f":"CALC!F2","v":0},{"$f":"CALC!G2","v":0}]
["M=",{"$f":"CALC!E3","v":0},{"$f":"CALC!F3","v":3},{"$f":"CALC!G3","v":0},"M_sm=",{"$f":"B10","v":0},{"$f":"C10","v":0},null,{"$f":"B9","v":0},{"$f":"D9","v":0},null,{"$f":"C8","v":0},{"$f":"D8","v":0}]
[null,{"$f":"CALC!E4","v":0},{"$f":"CALC!F4","v":0},{"$f":"CALC!G4","v":2}]
[{"$nulls":4},"M_ms",{"$f":"D8","v":0},null,null,{"$f":"C8","v":0},null,null,{"$f":"B9","v":0}]
[null,{"$f":"CALC!E10","v":0.07},{"$f":"CALC!F10","v":-0.02},{"$f":"CALC!G10","v":0},null,{"$f":"D9","v":0},null,null,{"$f":"C10","v":0},null,null,{"$f":"B10","v":0}]
["K=",{"$f":"CALC!E11","v":-0.02},{"$f":"CALC!F11","v":0.045},{"$f":"CALC!G11","v":-0.025}]
[null,{"$f":"CALC!E12","v":0},{"$f":"CALC!F12","v":-0.025},{"$f":"CALC!G12","v":0.025},"K_mm",{"$f":"B12","v":0.07},{"$f":"C12","v":-0.02},null,{"$f":"B12","v":0.07},{"$f":"D12","v":0},null,{"$f":"C13","v":0.045},{"$f":"D13","v":-0.025}]
[{"$nulls":5},{"$f":"B13","v":-0.02},{"$f":"C13","v":0.045},null,{"$f":"B14","v":0},{"$f":"D14","v":0.025},null,{"$f":"C14","v":-0.025},{"$f":"D14","v":0.025}]
[null,{"$f":"CALC!E6","v":0.4},{"$f":"CALC!F6","v":-0.3},{"$f":"CALC!G6","v":0}]
["D=",{"$f":"CALC!E7","v":-0.3},{"$f":"CALC!F7","v":0.5},{"$f":"CALC!G7","v":-0.2},"K_ss",{"$f":"D14","v":0.025},null,null,{"$f":"C13","v":0.045},null,null,{"$f":"B12","v":0.07}]
[null,{"$f":"CALC!E8","v":0},{"$f":"CALC!F8","v":-0.2},{"$f":"CALC!G8","v":0.2}]
[{"$nulls":4},"K_sm",{"$f":"B14","v":0},{"$f":"C14","v":-0.025},null,{"$f":"B13","v":-0.02},{"$f":"D13","v":-0.025},null,{"$f":"C12","v":-0.02},{"$f":"D12","v":0}]
[null,1,2,3]
["F=",{"$f":"HOME!E7","v":20},{"$f":"HOME!G7","v":10},{"$f":"HOME!I7","v":30},"K_ms",{"$f":"D12","v":0},null,null,{"$f":"C12","v":-0.02},null,null,{"$f":"B13","v":-0.02}]
["ω=",{"$f":"HOME!E8","v":0.5},{"$f":"HOME!G8","v":2},{"$f":"HOME!I8","v":1},null,{"$f":"D13","v":-0.025},null,null,{"$f":"C14","v":-0.025},null,null,{"$f":"B14","v":0}]
["ε=",{"$f":"HOME!E9","v":-1},{"$f":"HOME!G9","v":1.5},{"$f":"HOME!I9","v":0.6}]
[{"$nulls":4},"D_mm",{"$f":"B16","v":0.4},{"$f":"C16","v":-0.3},null,{"$f":"B16","v":0.4},{"$f":"D16","v":0},null,{"$f":"C17","v":0.5},{"$f":"D17","v":-0.2}]
[null,{"$f":"B21","v":20},{"$nulls":3},{"$f":"B17","v":-0.3},{"$f":"C17","v":0.5},null,{"$f":"B18","v":0},{"$f":"D18","v":0.2},null,{"$f":"C18","v":-0.2},{"$f":"D18","v":0.2}]
["F=",{"$f":"C21","v":10}]
[null,{"$f":"D21","v":30},null,null,"D_ss",{"$f":"D18","v":0.2},null,null,{"$f":"C17","v":0.5},null,null,{"$f":"B16","v":0.4}]
[]
[{"$nulls":4},"D_sm",{"$f":"B18","v":0},{"$f":"C18","v":-0.2},null,{"$f":"B17","v":-0.3},{"$f":"D17","v":-0.2},null,{"$f":"C16","v":-0.3},{"$f":"D16","v":0}]
[]
[{"$nulls":4},"D_ms",{"$f":"D16","v":0},null,null,{"$f":"C16","v":-0.3},null,null,{"$f":"B17","v":-0.3}]
[{"$nulls":5},{"$f":"D17","v":-0.2},null,null,{"$f":"C18","v":-0.2},null,null,{"$f":"B18","v":0}]
[]
[{"$nulls":4},"R_G",{"$f":"-1*MMULT(MINVERSE(F17),F19:G19)","v":0},1,null,{"$f":"-1*MMULT(MINVERSE(I17),I19:J19)","v":0.4444444444444444},0.5555555555555556,null,{"$f":"-1*(MMULT(MINVERSE(L17),L19:M19))","v":0.2857142857142857},0]
[]
[]
[{"$nulls":4},"T_G",1,0,null,1,0,null,{"$f":"L34","v":0.2857142857142857},{"$f":"M34","v":0}]
[{"$nulls":5},0,1,null,{"$f":"I34","v":0.4444444444444444},{"$f":"J34","v":0.5555555555555556},null,1,0]
[{"$nulls":5},{"$f":"F34","v":0},{"$f":"G34","v":1},null,0,1,null,0,1]
[]
[{"$nulls":4},"T_G_T",{"$f":"TRANSPOSE(F37:G39)","v":1},0,0,{"$f":"TRANSPOSE(I37:J39)","v":1},0.4444444444444444,0,{"$f":"TRANSPOSE(L37:M39)","v":0.2857142857142857},1,0]
[{"$nulls":5},0,1,1,0,0.5555555555555556,1,0,0,1]
[]
[{"$nulls":4},"TGT*Mn",{"$f":"MMULT(F41:H42,B8:D10)","v":5},0,0,{"$f":"MMULT(I41:K42,B8:D10)","v":5},1.3333333333333333,0,{"$f":"MMULT(L41:N42,B8:D10)","v":1.4285714285714284},3,0]
[{"$nulls":5},0,3,2,0,1.6666666666666667,2,0,0,2]
[]
[{"$nulls":4},"TGT*Kn",{"$f":"MMULT(F41:H42,B12:D14)","v":0.07},-0.02,0,{"$f":"MMULT(I41:K42,B12:D14)","v":0.061111111111111116},-3.469446951953614e-18,-0.011111111111111112,{"$f":"MMULT(L41:N42,B12:D14)","v":0},0.039285714285714285,-0.025]
[{"$nulls":5},-0.02,0.019999999999999997,0,-0.011111111111111112,0,0.011111111111111112,0,-0.025,0.025]
[]
[]
[{"$nulls":4},"TGT*Dn",{"$f":"MMULT(F41:H42,B16:D18)","v":0.4},-0.3,0,{"$f":"MMULT(I41:K42,B16:D18)","v":0.2666666666666667},-0.07777777777777778,-0.08888888888888889,{"$f":"MMULT(L41:N42,B16:D18)","v":-0.18571428571428572},0.4142857142857143,-0.2]
[{"$nulls":5},-0.3,0.3,0,-0.16666666666666666,0.07777777777777778,0.08888888888888889,0,-0.2,0.2]
[]
[{"$nulls":4},"Fm",{"$f":"B25","v":20},null,null,{"$f":"B25","v":20},null,null,{"$f":"B26","v":10}]
[{"$nulls":5},{"$f":"B26","v":10},null,null,{"$f":"B27","v":30},null,null,{"$f":"B27","v":30}]
[]
[{"$nulls":4},"Fs",{"$f":"B27","v":30},null,null,{"$f":"B26","v":10},null,null,{"$f":"B25","v":20}]
[]
[{"$nulls":4},"RGT",{"$f":"TRANSPOSE(F34:G34)","v":0},null,null,{"$f":"TRANSPOSE(I34:J34)","v":0.4444444444444444},null,null,{"$f":"TRANSPOSE(L34:M34)","v":0.2857142857142857}]
[{"$nulls":5},1,null,null,0.5555555555555556,null,null,0]
[]
[{"$nulls":4},"RGTF",{"$f":"MMULT(F59:F60,F57)","v":0},null,null,{"$f":"MMULT(I59:I60,I57)","v":4.444444444444445},null,null,{"$f":"MMULT(L59:L60,L57)","v":5.7142857142857135}]
[{"$nulls":5},30,null,null,5.555555555555555,null,null,0]
[]
[]
[{"$nulls":4},"MG",{"$f":"MMULT(F44:H45,F37:G39)","v":5},0,null,{"$f":"MMULT(I44:K45,I37:J39)","v":5.592592592592593},0.7407407407407407,null,{"$f":"MMULT(L44:N45,L37:M39)","v":3.4081632653061225},0]
[{"$nulls":5},0,5,null,0.7407407407407407,2.925925925925926,null,0,2]
[]
[{"$nulls":4},"KG",{"$f":"MMULT(F47:H48,F37:G39)","v":0.07},-0.02,null,{"$f":"MMULT(I47:K48,I37:J39)","v":0.061111111111111116},-0.011111111111111113,null,{"$f":"MMULT(L47:N48,L37:M39)","v":0.039285714285714285},-0.025]
[{"$nulls":5},-0.02,0.019999999999999997,null,-0.011111111111111112,0.011111111111111112,null,-0.025,0.025]
[]
[{"$nulls":4},"DG",{"$f":"MMULT(F51:H52,F37:G39)","v":0.4},-0.3,null,{"$f":"MMULT(I51:K52,I37:J39)","v":0.2320987654320988},-0.13209876543209878,null,{"$f":"MMULT(L51:N52,L37:M39)","v":0.36122448979591837},-0.2]
[{"$nulls":5},-0.3,0.3,null,-0.13209876543209875,0.13209876543209878,null,-0.2,0.2]
[]
[{"$nulls":4},"FG",{"$f":"F54:F55+F62:F63","v":20},null,null,{"$f":"I62:I63+I54:I55","v":24.444444444444443},null,null,{"$f":"L62:L63+L54:L55","v":15.714285714285714}]
[{"$nulls":5},40,null,null,35.55555555555556,null,null,30]
[]
[]
[{"$nulls":4},"pf",{"$f":"CALC!B23","v":-10},null,null,{"$f":"CALC!B23","v":-10},null,null,{"$f":"CALC!B24","v":15}]
[{"$nulls":5},{"$f":"CALC!B24","v":15},null,null,{"$f":"CALC!B25","v":-5},null,null,{"$f":"CALC!B25","v":-5}]
[]
[{"$nulls":5},{"$f":"CALC!B26","v":-5},null,null,{"$f":"CALC!B26","v":-5},null,null,{"$f":"CALC!B27","v":0}]
[{"$nulls":5},{"$f":"CALC!B27","v":0},null,null,{"$f":"CALC!B28","v":0},null,null,{"$f":"CALC!B28","v":0}]
[]
[]
[{"$nulls":4},"F",{"$f":"CALC!B32","v":0},{"$f":"CALC!C32","v":0},null,{"$f":"CALC!B32","v":0},{"$f":"CALC!C32","v":0},null,{"$f":"CALC!B33","v":0},{"$f":"CALC!C33","v":0}]
[{"$nulls":4},"F",{"$f":"CALC!B33","v":0},{"$f":"CALC!C33","v":0},null,{"$f":"CALC!B34","v":0},{"$f":"CALC!C34","v":0},null,{"$f":"CALC!B34","v":0},{"$f":"CALC!C34","v":0}]
[]
[{"$nulls":4},"x",{"$f":"CALC!B36","v":0},{"$f":"CALC!C36","v":7.0770978221989935},null,{"$f":"CALC!B36","v":0},{"$f":"CALC!C36","v":7.0770978221989935},null,{"$f":"CALC!B37","v":0},{"$f":"CALC!C37","v":13}]
[{"$nulls":4},"x",{"$f":"CALC!B37","v":0},{"$f":"CALC!C37","v":13},null,{"$f":"CALC!B38","v":0},{"$f":"CALC!C38","v":36.596694100124296},null,{"$f":"CALC!B38","v":0},{"$f":"CALC!C38","v":36.596694100124296}]
[]
[]
[]
[{"$nulls":4},"ω1=",{"$f":"B22","v":0.5},null,null,{"$f":"B22","v":0.5},null,null,{"$f":"C22","v":2}]
[{"$nulls":4},"ε1=",{"$f":"B23","v":-1},null,null,{"$f":"B23","v":-1},null,null,{"$f":"C23","v":1.5}]
[{"$nulls":4},"ω2=",{"$f":"C22","v":2},null,null,{"$f":"C22","v":2},null,null,{"$f":"D22","v":1}]
[{"$nulls":4},"ε2=",{"$f":"C23","v":1.5},null,null,{"$f":"C23","v":1.5},null,null,{"$f":"D23","v":0.6}]

{"sheet":"CALC","index":3,"n_rows":61,"n_cols":129,"rows_kept":61,"merged":[[0,26,0,28],[0,29,0,31],[0,32,0,34],[0,35,0,37],[0,38,0,40],[0,41,0,43],[0,44,0,46],[0,47,0,49],[0,50,0,52],[0,53,0,55],[0,56,0,58],[0,59,0,61],[0,62,0,64],[0,65,0,67],[0,68,0,70],[0,84,0,86],[0,87,0,89],[0,90,0,92],[0,93,0,95],[0,96,0,98],[0,99,0,101],[0,102,0,104],[0,105,0,107],[0,108,0,110],[0,111,0,113],[0,114,0,116],[0,117,0,119],[0,120,0,122],[0,123,0,125],[0,126,0,128]]}
["INPUT:","rk1an2",{"$f":"IF(HOME!AJ10=\"RK4\",1,2)","v":1},{"$nulls":5},"sajátértékfeladat",{"$nulls":3},"sajátvektorok",{"$nulls":9},"plot",null,25,"t","F(t)",null,null,"F(t+dt/2)",null,null,"F(t+dt)",null,null,"v(t)",null,null,"q(t)",null,null,"dq1",null,null,"dv1",null,null,"dq2",null,null,"dv2",null,null,"dq3",null,null,"dv3",null,null,"dq4",null,null,"dv4",null,null,"dq",null,null,"dv",{"$nulls":3},{"$f":"B30","v":0.1},74,{"$nulls":9},"t","F(t)",null,null,"F(t+dt/2)",null,null,"F(t+dt)",null,null,"v(t)",null,null,"q(t)",null,null,"dq1",null,null,"dv1",null,null,"dq2",null,null,"dv2",null,null,"dq3",null,null,"dv3",null,null,"dq4",null,null,"dv4",null,null,"dq",null,null,"dv"]
["m1=",{"$f":"HOME!E4","v":5},null,null,{"$f":"B2","v":5},0,0,null,{"$f":"E10-E2*$E$20^2","v":0.05802790407709131},-0.02,0,null,null,"α1=","α2=","α3=",{"$nulls":7},4,null,null,1,2,3,1,2,3,1,2,3,1,2,3,1,2,3,1,2,3,1,2,3,1,2,3,1,2,3,1,2,3,1,2,3,1,2,3,1,2,3,1,2,3,1,2,3,null,null,"qh1","qh2","qh3","qp1","qp2","qp3","q1","q2","q3",null,null,1,2,3,1,2,3,1,2,3,1,2,3,1,2,3,1,2,3,1,2,3,1,2,3,1,2,3,1,2,3,1,2,3,1,2,3,1,2,3,1,2,3,1,2,3]
["m2=",{"$f":"HOME!G4","v":3},null,"M=",0,{"$f":"B3","v":3},0,null,-0.02,0.037816742446254784,-0.025,null,"q1",1,1,1,{"$f":"B23-IF($O$21=\"f\",J20,0)","v":-24.09833433865472},{"$nulls":3},{"$f":"MINVERSE(E2:G4)","v":0.2},0,0,null,"t1",{"$f":"Z4+$B$30","v":0.1},{"$f":"IF(B32=1,C32,$B$14*SIN($B$15*$Z$3+$B$16))","v":-16.268310095787474},{"$f":"IF(B33=1,C33,$B$17*SIN($B$18*$Z$3+$B$19))","v":9.916648104524686},{"$f":"IF(B34=1,C34,$B$20*SIN($B$21*$Z$3+$B$22))","v":19.32653061713073},{"$f":"IF(B32=1,C32,$B$14*SIN($B$15*($Z$3+$B$30/2)+$B$16))","v":-15.972415263976284},{"$f":"IF(B33=1,C33,$B$17*SIN($B$18*($Z$3+$B$30/2)+$B$19))","v":9.738476308781951},{"$f":"IF(B34=1,C34,$B$20*SIN($B$21*($Z$3+$B$30/2)+$B$22))","v":20.449162800700023},{"$f":"IF(B32=1,C32,$B$14*SIN($B$15*($Z$3+$B$30)+$B$16))","v":-15.666538192549668},{"$f":"IF(B33=1,C33,$B$17*SIN($B$18*($Z$3+$B$30)+$B$19))","v":9.463000876874144},{"$f":"IF(B34=1,C34,$B$20*SIN($B$21*($Z$3+$B$30)+$B$22))","v":21.520682726985683},{"$f":"IF(B36=1,0,$AJ$4+$BQ$3)","v":-5.268854752910833},{"$f":"IF(B37=1,0,$AK$4+$BR$3)","v":0.2487398775928583},{"$f":"IF(B38=1,0,$AL$4+$BS$3)","v":0.9290823535005542},{"$f":"IF(AND($B$45=1,$B$32=1),M44,IF(AND($B$45=1,$B$32=0),$M$40*SIN($B$15*Z3+$B$16),IF(B36=1,C36,$AM$4+$BN$3)))","v":-10.513572682678912},{"$f":"IF(AND($B$45=1,$B$33=1),M45,IF(AND($B$45=1,$B$33=0),$M$41*SIN($B$18*Z3+$B$19),IF(B37=1,C37,$AN$4+$BO$3)))","v":15.01246128643359},{"$f":"IF(AND($B$45=1,$B$34=1),M46,IF(AND($B$45=1,$B$34=0),$M$42*SIN($B$21*Z3+$B$22),IF(B38=1,C38,$AO$4+$BP$3)))","v":-4.954483552744303},{"$f":"$B$30*$AJ$4","v":-0.5},{"$f":"$B$30*$AK$4","v":0},{"$f":"$B$30*$AL$4","v":0},{"$f":"$B$30*(MMULT($AA$4:$AC$4,$U$3:$W$5)-MMULT($AM$4:$AO$4,$U$7:$W$9)-MMULT($AJ$4:$AL$4,$U$11:$W$13))","v":-0.27658839392315865},0.24916499553468482,0.871963710092553,{"$f":"$B$30*($AJ$4+$AS$3/2)","v":-0.513829419696158},{"$f":"$B$30*(AK4+AT3/2)","v":0.012458249776734242},{"$f":"$B$30*(AL4+AU3/2)","v":0.04359818550462766},{"$f":"$B$30*(MMULT($AD$4:$AF$4,$U$3:$W$5)-MMULT(($AM$4:$AO$4)+0.5*($AP$3:$AR$3),$U$7:$W$9)-MMULT(($AJ$4:$AL$4)+0.5*($AS$3:$AU$3),$U$11:$W$13))","v":-0.2688769067046064},0.2491384297817387,0.92966561503127,{"$f":"$B$30*(AJ4+0.5*AY3)","v":-0.5134438453352304},{"$f":"$B$30*(AK4+0.5*AZ3)","v":0.012456921489086935},{"$f":"$B$30*(AL4+0.5*BA3)","v":0.0464832807515635},{"$f":"$B$30*(MMULT($AD$4:$AF$4,$U$3:$W$5)-MMULT(($AM$4:$AO$4)+0.5*($AV$3:$AX$3),$U$7:$W$9)-MMULT(($AJ$4:$AL$4)+0.5*($AY$3:$BA$3),$U$11:$W$13))","v":-0.26889566010699684},0.24937376069896408,0.9293575102179817,{"$f":"$B$30*(AJ4+BE3)","v":-0.5268895660106997},{"$f":"$B$30*(AK4+BF3)","v":0.02493737606989641},{"$f":"$B$30*(AL4+BG3)","v":0.09293575102179819},{"$f":"$B$30*(MMULT($AG$4:$AI$4,$U$3:$W$5)-MMULT(($AM$4:$AO$4+$BB$3:$BD$3),$U$7:$W$9)-MMULT(($AJ$4:$AL$4+$BE$3:$BG$3),$U$11:$W$13))","v":-0.2609949899186348},0.24624988906105927,0.9844841604122682,{"$f":"(AP3+2*AV3+2*BB3+BH3)/6","v":-0.5135726826789128},0.012461286433589793,0.04551644725569675,-0.26885475291083333,0.2487398775928583,0.9290823535005542,null,0,{"$f":"($Q$15*SIN($E$20*BU3)+$Q$7*COS($E$20*BU3))*$N$3+($Q$16*SIN($E$21*BU3)+$Q$8*COS($E$21*BU3))*$O$3+($Q$17*SIN($E$22*BU3)+$Q$9*COS($E$22*BU3))*$P$3","v":-24.098334338654723},{"$f":"($Q$15*SIN($E$20*BU3)+$Q$7*COS($E$20*BU3))*$N$4+($Q$16*SIN($E$21*BU3)+$Q$8*COS($E$21*BU3))*$O$4+($Q$17*SIN($E$22*BU3)+$Q$9*COS($E$22*BU3))*$P$4","v":26.462115008729448},{"$f":"($Q$15*SIN($E$20*BU3)+$Q$7*COS($E$20*BU3))*$N$5+($Q$16*SIN($E$21*BU3)+$Q$8*COS($E$21*BU3))*$O$5+($Q$17*SIN($E$22*BU3)+$Q$9*COS($E$22*BU3))*$P$5","v":30.32014305008959},{"$f":"$M$29*SIN($B$15*BU3+$B$16)","v":14.09833433865472},{"$f":"$M$30*SIN($B$18*BU3+$B$19)","v":-11.462115008729448},{"$f":"$M$31*SIN($B$21*BU3+$B$22)","v":-35.3201430500896},{"$f":"IF(B45=1,M40*SIN(B15*BU3+B16),BV3+BY3)","v":-10.000000000000004},{"$f":"IF(B45=1,M41*SIN(B15*BU3+B19),BW3+BZ3)","v":15},{"$f":"IF(B45=1,M42*SIN(B15*BU3+B22),BX3+CA3)","v":-5.000000000000007},"t0",0,{"$f":"$B$14*SIN($B$15*$CF3+$B$16)","v":-16.82941969615793},{"$f":"$B$17*SIN($B$18*$CF3+$B$19)","v":9.974949866040545},{"$f":"$B$20*SIN($B$21*$CF3+$B$22)","v":16.93927420185106},{"$f":"$B$14*SIN($B$15*($CF3+$B$30/2)+$B$16)","v":-16.554037763345153},{"$f":"$B$17*SIN($B$18*($CF3+$B$30/2)+$B$19)","v":9.99573603041505},{"$f":"$B$20*SIN($B$21*($CF3+$B$30/2)+$B$22)","v":18.155592172081185},{"$f":"$B$14*SIN($B$15*($CF3+$B$30)+$B$16)","v":-16.268310095787474},{"$f":"$B$17*SIN($B$18*($CF3+$B$30)+$B$19)","v":9.916648104524686},{"$f":"$B$20*SIN($B$21*($CF3+$B$30)+$B$22)","v":19.32653061713073},{"$f":"B26","v":-5},{"$f":"B27","v":0},{"$f":"B28","v":0},{"$f":"B23","v":-10},{"$f":"B24","v":15},{"$f":"B25","v":-5}]
["m3=",{"$f":"HOME!I4","v":2},null,null,0,0,{"$f":"B4","v":2},null,0,-0.025,0.020211161630836524,null,"q2",{"$f":"(-$I$2/$I$3)*N3","v":2.9013952038545656},{"$f":"(-$I$6/$I$7)*O3","v":0.07553262829328028},{"$f":"(-$I$10/$I$11)*P3","v":-2.851927832147848},{"$f":"B24-IF($O$21=\"f\",J21,0)","v":26.462115008729448},null,null,"M-1",0,0.3333333333333333,0,null,"t0",0,-16.82941969615793,9.974949866040545,16.93927420185106,-16.554037763345153,9.99573603041505,18.155592172081185,-16.268310095787474,9.916648104524686,19.32653061713073,-5,0,0,-10,15,-5,{"$nulls":41},"t1",{"$f":"CF3+$B$30","v":0.1},{"$f":"$B$14*SIN($B$15*$CF4+$B$16)","v":-16.268310095787474},{"$f":"$B$17*SIN($B$18*$CF4+$B$19)","v":9.916648104524686},{"$f":"$B$20*SIN($B$21*$CF4+$B$22)","v":19.32653061713073},{"$f":"$B$14*SIN($B$15*($CF4+$B$30/2)+$B$16)","v":-15.972415263976284},{"$f":"$B$17*SIN($B$18*($CF4+$B$30/2)+$B$19)","v":9.738476308781951},{"$f":"$B$20*SIN($B$21*($CF4+$B$30/2)+$B$22)","v":20.449162800700023},{"$f":"$B$14*SIN($B$15*($CF4+$B$30)+$B$16)","v":-15.666538192549668},{"$f":"$B$17*SIN($B$18*($CF4+$B$30)+$B$19)","v":9.463000876874144},{"$f":"$B$20*SIN($B$21*($CF4+$B$30)+$B$22)","v":21.520682726985683},{"$f":"$CP3+$DW4","v":-5.268854752910833},{"$f":"$CQ3+$DX4","v":0.2487398775928583},{"$f":"$CR3+$DY4","v":0.9290823535005542},{"$f":"$CS3+$DT4","v":-10.513572682678912},{"$f":"$CT3+$DU4","v":15.01246128643359},{"$f":"$CU3+$DV4","v":-4.954483552744303},{"$f":"$B$30*$CP3","v":-0.5},{"$f":"$B$30*$CQ3","v":0},{"$f":"$B$30*$CR3","v":0},{"$f":"$B$30*(MMULT($CG3:$CI3,$U$3:$W$5)-MMULT($CS3:$CU3,$U$7:$W$9)-MMULT($CP3:$CR3,$U$11:$W$13))","v":-0.27658839392315865},0.24916499553468482,0.871963710092553,{"$f":"$B$30*($CP3+$CY4/2)","v":-0.513829419696158},{"$f":"$B$30*(CQ3+CZ4/2)","v":0.012458249776734242},{"$f":"$B$30*(CR3+DA4/2)","v":0.04359818550462766},{"$f":"$B$30*(MMULT($CJ3:$CL3,$U$3:$W$5)-MMULT(($CS3:$CU3)+0.5*($CV4:$CX4),$U$7:$W$9)-MMULT(($CP3:$CR3)+0.5*($CY4:$DA4),$U$11:$W$13))","v":-0.2688769067046064},0.2491384297817387,0.92966561503127,{"$f":"$B$30*(CP3+0.5*DE4)","v":-0.5134438453352304},{"$f":"$B$30*(CQ3+0.5*DF4)","v":0.012456921489086935},{"$f":"$B$30*(CR3+0.5*DG4)","v":0.0464832807515635},{"$f":"$B$30*(MMULT($CJ3:$CL3,$U$3:$W$5)-MMULT(($CS3:$CU3)+0.5*($DB4:$DD4),$U$7:$W$9)-MMULT(($CP3:$CR3)+0.5*($DE4:$DG4),$U$11:$W$13))","v":-0.26889566010699684},0.24937376069896408,0.9293575102179817,{"$f":"$B$30*(CP3+DK4)","v":-0.5268895660106997},{"$f":"$B$30*(CQ3+DL4)","v":0.02493737606989641},{"$f":"$B$30*(CR3+DM4)","v":0.09293575102179819},{"$f":"$B$30*(MMULT($CM3:$CO3,$U$3:$W$5)-MMULT(($CS3:$CU3+$DH4:$DJ4),$U$7:$W$9)-MMULT(($CP3:$CR3+$DK4:$DM4),$U$11:$W$13))","v":-0.2609949899186348},0.24624988906105927,0.9844841604122682,{"$f":"(CV4+2*DB4+2*DH4+DN4)/6","v":-0.5135726826789128},0.012461286433589793,0.04551644725569675,-0.26885475291083333,0.2487398775928583,0.9290823535005542]
["k1=",{"$f":"HOME!E5","v":0.1},{"$nulls":10},"q3",{"$f":"((-($J$2-($I$2*$J$3)/$J$2))/$K$3)*N3","v":3.5888526063586794},{"$f":"((-($J$6-($I$6*$J$7)/$J$6))/$K$7)*O3","v":-0.7881975991950987},{"$f":"((-($J$10-($I$10*$J$11)/$J$10))/$K$11)*P3","v":2.76184499283643},30.320143050089598,{"$nulls":3},0,0,0.5]
["k2=",{"$f":"HOME!G5","v":0.3},null,null,{"$f":"B5+B6","v":0.4},{"$f":"-B6","v":-0.3},0,null,{"$f":"E10-E2*$E$21^2","v":1.5106525658656056E-3},{"$f":"F10-F2*$E$21^2","v":-0.02},0,null,"peremfeltételek"]
["k3=",{"$f":"HOME!I5","v":0.2},null,"K=",{"$f":"-B6","v":-0.3},{"$f":"B6+B7","v":0.5},{"$f":"-B7","v":-0.2},null,{"$f":"E11-E3*$E$21^2","v":-0.02},{"$f":"F11-F3*$E$21^2","v":0.003906391539519362},{"$f":"G11-G3*$E$21^2","v":-0.025},null,null,{"$f":"MINVERSE(N3:P5)","v":0.08926338497474925},0.15539301422733673,0.12814125272761062,{"$f":"MMULT(N7:P9,Q3:Q5)","v":5.8461900320341975},"b1",null,null,{"$f":"MMULT(E10:G12,U3:W5)","v":0.014000000000000002},-0.006666666666666666,0]
["c1=",{"$f":"HOME!E6","v":20},null,null,0,{"$f":"-B7","v":-0.2},{"$f":"B7","v":0.2},null,0,-0.025,-2.3957389736537563E-3,null,null,0.7987697100266596,0.03619990535962486,-0.2518353471011109,-25.926777222055858,"b2",null,"CM-1",-0.004,0.015,-0.0125]
["c2=",{"$f":"HOME!G6","v":50},{"$nulls":11},0.11196690499859116,-0.19159291958696162,0.12369409437350022,-4.017747148633063,"b3",null,null,0,-0.008333333333333333,0.0125]
["c3=",{"$f":"HOME!I6","v":40},null,null,{"$f":"B11+B12","v":0.07},{"$f":"-B12","v":-0.02},0,null,{"$f":"E10-E2*$E$22^2","v":-0.057038556642956956},{"$f":"F10-F2*$E$22^2","v":-0.02},0]
["s1",{"$f":"1/B8","v":0.05},null,"C=",{"$f":"-B12","v":-0.02},{"$f":"B12+B13","v":0.045},{"$f":"-B13","v":-0.025},null,{"$f":"E11-E3*$E$22^2","v":-0.02},{"$f":"F11-F3*$E$22^2","v":-0.031223133985774185},{"$f":"G11-G3*$E$22^2","v":-0.025},null,null,{"$f":"N3*$E$20","v":0.04893280274602855},{"$f":"O3*$E$21","v":0.11703789765211471},{"$f":"P3*$E$22","v":0.15939796525862993},{"$f":"B26-IF($O$21=\"f\",K20,0)","v":-0.4737818120881938},{"$nulls":3},{"$f":"MMULT(E6:G8,U3:W5)","v":0.08000000000000002},-0.09999999999999999,0]
["s2",{"$f":"1/B9","v":0.02},null,null,0,{"$f":"-B13","v":-0.025},{"$f":"B13","v":0.025},null,0,-0.025,-0.025815422657182785,null,null,{"$f":"N4*$E$20","v":0.14197339919848875},{"$f":"O4*$E$21","v":8.840180019584162E-3},{"$f":"P4*$E$22","v":-0.4545914935088224},{"$f":"B27-IF($O$21=\"f\",K21,0)","v":1.6256682024462892},null,null,"KM-1",-0.06,0.16666666666666666,-0.1]
["s3",0.025,{"$nulls":11},0.1756126166715197,-0.0922489899442385,0.44023247221786227,51.627309946534766,{"$nulls":3},0,-0.06666666666666667,0.1]
["F1=",{"$f":"HOME!E7","v":20},null,"3-madfokú egyenlet:"]
["ω1=",{"$f":"HOME!E8","v":0.5},null,"a",{"$f":"-E2*F3*G4","v":-30},{"$nulls":8},{"$f":"MINVERSE(N11:P13)","v":1.8242033966058482},3.17564099146045,2.618718845774898,{"$f":"MMULT(N15:P17,Q11:Q13)","v":139.49567370499335},"a1"]
["ε1=",{"$f":"HOME!E9","v":-1},null,"b",{"$f":"E10*F3*G4+E2*(F11*G4+G12*F3)","v":1.245},{"$nulls":8},6.824880880900094,0.30930071443376433,-2.15174189004719,-113.81932957699883,"a2"]
["F2=",{"$f":"HOME!G7","v":10},null,"c",{"$f":"-E10*(F11*G4+G12*F3)-E2*(F11*G12-G11^2)+F10^2*G4","v":-0.01325},{"$nulls":8},0.7024362250604651,-1.2019784523352857,0.7760079883880658,37.77638527992501,"a3"]
["ω2=",{"$f":"HOME!G8","v":2},null,"d",{"$f":"E10*(F11*G12-G11^2)-(F10^2)*G12","v":2.4999999999999991E-5}]
["ε2=",{"$f":"HOME!G9","v":1.5},null,"sajátfrekik:",{"$nulls":4},"pf-hez","x0","v0"]
["F3=",{"$f":"HOME!I7","v":30},null,"α1=",{"$f":"(SMALL(CARDANO!B9:B11,1))^0.5","v":0.04893280274602855},{"$nulls":3},"q1",{"$f":"M29*(SIN(B16))","v":14.09833433865472},{"$f":"M29*B15*COS(B16)","v":-4.526218187911806},null,null,"konstansok:"]
["ω3=",{"$f":"HOME!I8","v":1},null,"α2=",{"$f":"(SMALL(CARDANO!B9:B11,2))^0.5","v":0.11703789765211471},{"$nulls":3},"q2",{"$f":"M30*(SIN(B19))","v":-11.462115008729448},{"$f":"M30*B18*COS(B19)","v":-1.6256682024462892},null,null,"h vagy f:","f"]
["ε3=",{"$f":"HOME!I9","v":0.6},null,"α3=",{"$f":"(SMALL(CARDANO!B9:B11,3))^0.5","v":0.15939796525862993},{"$nulls":3},"q3",{"$f":"M31*(SIN(B22))","v":-35.3201430500896},{"$f":"M31*B21*COS(B22)","v":-51.627309946534766}]
["X1=",{"$f":"HOME!E10","v":-10}]
["X2=",{"$f":"HOME!G10","v":15},null,"partikuláris megoldás:"]
["X3=",{"$f":"HOME!I10","v":-5},null,null,{"$f":"B15","v":0.5},0,0,null,null,{"$f":"(E10:G12-MMULT((E25:G27)^2,E2:G4))","v":-1.18},-0.02,0,{"$f":"B14","v":20},"F1"]
["V1=",{"$f":"HOME!E11","v":-5},null,"ω=",0,{"$f":"B15","v":0.5},0,null,"C-ω^2M",-0.02,-0.705,-0.025,{"$f":"B17","v":10},"F2"]
["V2=",{"$f":"HOME!G11","v":0},null,null,0,0,{"$f":"B15","v":0.5},null,null,0,-0.025,-0.475,{"$f":"B20","v":30},"F3"]
["V3=",{"$f":"HOME!I11","v":0}]
["t0",0,{"$nulls":7},{"$f":"MINVERSE(J25:L27)","v":-0.8478660663326781},0.024097913628004314,-1.2683112435791747E-3,{"$f":"MMULT(J29:L31,M25:M27)","v":-16.754391527680895},"qp1"]
["dt",{"$f":"HOME!U5","v":0.1},{"$nulls":7},0.024097913628004314,-1.4217769040522545,0.0748303633711713,-11.49089986682732,"qp2"]
[{"$nulls":9},-1.2683112435791745E-3,0.0748303633711713,-2.109201598072167,-62.553110533324876,"qp3"]
["F1",{"$f":"HOME!AI1","v":0},{"$f":"HOME!AJ1-30000","v":0}]
["F2",{"$f":"HOME!AI2","v":0},{"$f":"HOME!AJ2-30000","v":0}]
["F3",{"$f":"HOME!AI3","v":0},{"$f":"HOME!AJ3-30000","v":0},{"$nulls":6},"F_pre","F_man"]
["allgrabbed",0,{"$nulls":7},{"$f":"M25:M27","v":20},{"$f":"C32","v":0}]
["x1",0,{"$f":"HOME!AK5-30000","v":7.0770978221989935},null,7.077097822197773,{"$nulls":4},10,{"$f":"C33","v":0}]
["x2",0,{"$f":"HOME!AK6-30000","v":13},null,20.538905190772937,{"$nulls":4},30,0]
["x3",0,{"$f":"HOME!AK7-30000","v":36.596694100124296},null,36.596694100123415]
[{"$nulls":8},"STATIC CASE"]
["plot rk",0,{"$nulls":7},{"$f":"MINVERSE(E10:G12)","v":19.999999999999996},20.000000000000004,20,{"$f":"MMULT(J40:L42,J35:J37)","v":1200}]
["plot an",0,{"$nulls":6},"C-1",20,70.00000000000001,70,3200]
["plot inf",1,{"$nulls":7},20,70.00000000000001,110,4400]
["plot until",100]
[{"$nulls":11},"man",{"$f":"MMULT(J40:L42,K35:K37)","v":0}]
["STATIC",{"$f":"IF(HOME!AJ43=\"STATIC\",1,0)","v":0},{"$nulls":10},0]
[{"$nulls":12},0]
[]
["GUYAN",{"$f":"HOME!AJ50","v":0}]
[]
[]
[{"$nulls":9},1,0,0,0]
[{"$nulls":9},1,1,1,1]
[{"$nulls":9},2,0,0,0]
[{"$nulls":9},2,{"$f":"N4","v":2.9013952038545656},{"$f":"O4","v":0.07553262829328028},{"$f":"P4","v":-2.851927832147848}]
[{"$nulls":9},3,0,0,0]
[{"$nulls":9},3,{"$f":"N5","v":3.5888526063586794},{"$f":"O5","v":-0.7881975991950987},{"$f":"P5","v":2.76184499283643}]
[]
[{"$nulls":9},0,0,0,0]
[{"$nulls":9},1,{"$f":"N3","v":1},{"$f":"O3","v":1},1]
[{"$nulls":9},2,{"$f":"N4","v":2.9013952038545656},0.07553262829328028,-2.851927832147848]
[{"$nulls":9},3,3.5888526063586794,-0.7881975991950987,2.76184499283643]

{"sheet":"2DOF","index":4,"n_rows":40,"n_cols":57,"rows_kept":40,"merged":[[1,26,1,27],[1,28,1,29],[1,30,1,31],[1,32,1,33],[1,34,1,35],[1,37,1,38],[1,39,1,40],[1,41,1,42],[1,43,1,44],[1,45,1,46],[1,47,1,48],[1,49,1,50],[1,51,1,52],[1,53,1,54],[1,55,1,56]]}
[1,2,3,4,5,6,7,8,9,10,11,12,13,14,15,16,17,18,19,20,21,22,23,24,25,26,27,28,29,30,31,32,33,34,35,36,null,37,38,39,40,41,42,43,44,45,46,47,48,49,50,51,52,53,54,55,56]
[{"$nulls":3},"INPUT:",{"$f":"IF(HOME!AJ46=\"1 and 2\",1,IF(HOME!AJ46=\"1 and 3\",2,3))","v":3},{"$nulls":19},4,0.01,"F(t)",null,"F(t+dt/2)",null,"F(t+dt)",null,"v(t)",null,"q(t)",null,"qs","dq1",null,"dv1",null,"dq2",null,"dv2",null,"dq3",null,"dv3",null,"dq4",null,"dv4",null,"dq",null,"dv"]
[{"$nulls":7},"2-odfokú egyenlet:",{"$nulls":4},"sajátvektorok:",{"$nulls":3},"t","qh1","qh2","qp1","qp2","q1","q2",null,"t1",{"$f":"$Z$4+$B$23","v":0.1},{"$f":"$E$13*SIN($E$16*Z3+$E$17)","v":15.583304164253077},{"$f":"$E$14*SIN($E$18*Z3+$E$19)","v":19.32653061713073},{"$f":"$E$13*SIN($E$16*(Z3+$Z$2/2)+$E$17)","v":15.56227835102534},{"$f":"$E$14*SIN($E$18*(Z3+$Z$2/2)+$E$19)","v":19.441014886068217},{"$f":"$E$13*SIN($E$16*(Z3+$Z$2)+$E$17)","v":15.539696322931022},{"$f":"$E$14*SIN($E$18*(Z3+$Z$2)+$E$19)","v":19.5550131306461},{"$f":"AG4+BD3","v":0.010979414150229586},{"$f":"AH4+BE3","v":0.01248456014085532},{"$f":"IF(AND(B40=1,B27=1),I39,IF(AND(B40=1,B27=0),I36*SIN(E16*Q4+E17),AI4+BB3))","v":3.662532731314191E-4},{"$f":"IF(AND(B40=1,B27=1),I39,IF(AND(B40=1,B27=0),I36*SIN(E16*Q4+E17),AJ4+BC3))","v":4.1636837872952834E-4},null,{"$f":"$B$23*$AG$4","v":0},{"$f":"$B$23*$AH$4","v":0},{"$f":"$B$23*(MMULT(AA4:AB4,M19:N20)-MMULT(AI4:AJ4,M22:N23)-MMULT(AG4:AH4,M25:N26))","v":0},0,{"$f":"$B$23*(AG4+0.5*AN3)","v":0},{"$f":"$B$23*(AH4+0.5*AO3)","v":0},{"$f":"$B$23*(MMULT(AC4:AD4,M19:N20)-MMULT((AI4:AJ4)+0.5*(AL3:AM3),M22:N23)-MMULT((AG4:AH4)+0.5*(AN3:AO3),M25:N26))","v":0.010998410004176219},0.012494792317669583,{"$f":"$B$23*(AG4+0.5*AR3)","v":0.000549920500208811},{"$f":"$B$23*(AH4+0.5*AS3)","v":6.2473961588347922E-4},{"$f":"$B$23*(MMULT(AC4:AD4,M19:N20)-MMULT((AI4:AJ4)+0.5*(AP3:AQ3),M22:N23)-MMULT((AG4:AH4)+0.5*(AR3:AS3),M25:N26))","v":0.010976786383708926},0.012487310406102117,{"$f":"$B$23*(AG4+AV3)","v":1.0976786383708928E-3},{"$f":"$B$23*(AH4+AW3)","v":1.2487310406102117E-3},{"$f":"$B$23*(MMULT(AE4:AF4,M19:N20)-MMULT((AI4:AJ4)+(AT3:AU3),M22:N23)-MMULT((AG4:AH4)+(AV3:AW3),M25:N26))","v":0.02192609212560722},0.024943155397588516,{"$f":"(AL3+2*AP3+2*AT3+AX3)/6","v":3.662532731314191E-4},{"$f":"(AM3+2*AQ3+2*AU3+AY3)/6","v":4.1636837872952834E-4},{"$f":"(AN3+2*AR3+2*AV3+AZ3)/6","v":0.010979414150229586},0.01248456014085532]
["m1=",1,null,"M=",{"$f":"IF($E$2=1,GUYAN!F66,IF($E$2=2,GUYAN!I66,IF($E$2=3,GUYAN!L66)))","v":3.4081632653061225},{"$f":"IF($E$2=1,GUYAN!G66,IF($E$2=2,GUYAN!J66,IF($E$2=3,GUYAN!M66)))","v":0},null,"a",{"$f":"E4*F5-E5*F4","v":6.816326530612245},{"$nulls":3},"α1","α2",null,null,0,{"$f":"($O$14*SIN($I$11*Q4)+$O$8*COS($I$11*Q4))*$M$5+($O$15*SIN($I$12*Q4)+$O$9*COS($O$15*Q4))*$N$5","v":16.14623568574458},{"$f":"(O14*SIN($I$11*Q4)+$O$8*COS($I$11*Q4))*$M$6+($O$15*SIN($I$12*Q4)+$O$9*COS($I$12*Q4))*$N$6","v":-1.251260977306833},{"$f":"$J$28*SIN($E$16*Q4+$E$17)","v":-1.1462356857445828},{"$f":"$J$29*SIN($E$16*Q4+$E$17)","v":-3.7487390226931687},{"$f":"IF(B40=1,I36*SIN(E16*Q4+E17),R4+T4)","v":14.999999999999996},{"$f":"IF(B40=1,I37*SIN(E16*Q4+E17),S4+U4)","v":-5.000000000000002},null,"t0",0,0,0,0.37484376953008747,0.24989584635339165,0.7487506248512111,0.4991670832341408,0,0,0,0]
["m2=",1,null,null,{"$f":"IF($E$2=1,GUYAN!F67,IF($E$2=2,GUYAN!I67,IF($E$2=3,GUYAN!L67)))","v":0},{"$f":"IF($E$2=1,GUYAN!G67,IF($E$2=2,GUYAN!J67,IF($E$2=3,GUYAN!M67)))","v":2},null,"b",{"$f":"-E7*F5-E4*F8+E8*F4+F7*E5","v":-0.16377551020408165},null,null,"q1",1,1,{"$f":"E22-E30","v":16.146235685744582}]
["k1=",1,{"$nulls":5},"c",{"$f":"E7*F8-E8*F7","v":3.5714285714285709E-4},null,null,"q2",{"$f":"-H16/I16","v":1.2407621585424424},{"$f":"-H20/I20","v":-1.3734152197669325},{"$f":"E23-E31","v":-1.2512609773068313}]
["k2=",1,null,"C=",{"$f":"IF($E$2=1,GUYAN!F69,IF($E$2=2,GUYAN!I69,IF($E$2=3,GUYAN!L69)))","v":0.039285714285714285},{"$f":"IF($E$2=1,GUYAN!G69,IF($E$2=2,GUYAN!J69,IF($E$2=3,GUYAN!M69)))","v":-0.025}]
["c1=",1,null,null,{"$f":"IF($E$2=1,GUYAN!F70,IF($E$2=2,GUYAN!I70,IF($E$2=3,GUYAN!L70)))","v":-0.025},{"$f":"IF($E$2=1,GUYAN!G70,IF($E$2=2,GUYAN!J70,IF($E$2=3,GUYAN!M70)))","v":0.025},null,"α1^2=",{"$f":"(-I5+(I5^2-4*I4*I6)^0.5)/(2*I4)","v":0.02160139906715265},{"$f":"I8^0.5","v":0.14697414421303037},null,null,{"$f":"MINVERSE(M5:N6)","v":0.5253718554687896},0.38252951322175166,{"$f":"MMULT(M8:N9,O5:O6)","v":8.00413354849346},"b1"]
["c2=",1,{"$nulls":5},"α2^2=",{"$f":"(-I5-(I5^2-4*I4*I6)^0.5)/(2*I4)","v":0.002425547040631784},{"$f":"I9^0.5","v":0.049249843051849256},null,null,0.47462814453121027,-0.38252951322175155,8.14210213725112,"b2"]
["s1",{"$f":"1/B8","v":1},null,"K=",{"$f":"IF($E$2=1,GUYAN!F72,IF($E$2=2,GUYAN!I72,IF($E$2=3,GUYAN!L72)))","v":0.36122448979591837},{"$f":"IF($E$2=1,GUYAN!G72,IF($E$2=2,GUYAN!J72,IF($E$2=3,GUYAN!M72)))","v":-0.2},null,"sajátfrekik:"]
["s2",{"$f":"1/B9","v":1},null,null,{"$f":"IF($E$2=1,GUYAN!F73,IF($E$2=2,GUYAN!I73,IF($E$2=3,GUYAN!L73)))","v":-0.2},{"$f":"IF($E$2=1,GUYAN!G73,IF($E$2=2,GUYAN!J73,IF($E$2=3,GUYAN!M73)))","v":0.2},null,"α1=",{"$f":"SMALL(J8:J9,1)","v":0.049249843051849256},{"$nulls":3},{"$f":"$I$11*M5","v":0.049249843051849256},{"$f":"$I$12*N5","v":0.14697414421303037},{"$f":"E25-F30","v":0.1625702503774423}]
["F1=",{"$nulls":6},"α2=",{"$f":"SMALL(J8:J9,2)","v":0.14697414421303037},{"$nulls":3},{"$f":"$I$11*M6","v":0.061107341572888996},{"$f":"$I$12*N6","v":-0.20185652657439593},{"$f":"E26-F31","v":0.5316824882511271}]
["ω1=",null,null,"F=",{"$f":"IF($E$2=1,GUYAN!F75,IF($E$2=2,GUYAN!I75,IF($E$2=3,GUYAN!L75)))","v":15.714285714285714}]
["ε1=",{"$nulls":3},{"$f":"IF($E$2=1,GUYAN!F76,IF($E$2=2,GUYAN!I76,IF($E$2=3,GUYAN!L76)))","v":30},null,null,"sajátértékfeladat:",{"$nulls":4},{"$f":"MINVERSE(M11:N12)","v":10.6674828367613},7.7671214671492885,{"$f":"MMULT(M14:N15,O11:O12)","v":5.863857823872031},"a1"]
["F2=",{"$nulls":11},3.229330894033067,-2.60269937457365,-0.8588165476484053,"a2"]
["ω2=",null,null,"ω1=",{"$f":"IF($E$2=1,GUYAN!F94,IF('2DOF'!$E$2=2,GUYAN!I94,GUYAN!L94))","v":2},null,null,{"$f":"E7-I11^2*E4","v":0.031019053963561062},{"$f":"F7-I11^2*F4","v":-0.025}]
["ε2=",null,null,"ε1=",{"$f":"IF($E$2=1,GUYAN!F95,IF('2DOF'!$E$2=2,GUYAN!I95,GUYAN!L95))","v":1.5},null,null,{"$f":"E8-I11^2*E5","v":-0.025},{"$f":"F8-I11^2*F5","v":0.020148905918736432}]
["X1=",null,null,"ω2=",{"$f":"IF($E$2=1,GUYAN!F96,IF('2DOF'!$E$2=2,GUYAN!I96,GUYAN!L96))","v":1},null,null,{"$f":"H16/H17","v":-1.2407621585424424},{"$f":"I16/I17","v":-1.240762158542442}]
["X2=",null,null,"ε2=",{"$f":"IF($E$2=1,GUYAN!F97,IF('2DOF'!$E$2=2,GUYAN!I97,GUYAN!L97))","v":0.6},{"$nulls":6},"M-1",{"$f":"MINVERSE(E4:F5)","v":0.2934131736526946},0]
["V1=",{"$nulls":6},{"$f":"E7-I12^2*E4","v":-0.03433538049417331},{"$f":"F7-I12^2*F4","v":-0.025},{"$nulls":3},0,0.5]
["V2=",{"$nulls":6},{"$f":"E8-I12^2*E5","v":-0.025},{"$f":"F8-I12^2*F5","v":-0.018202798134305295}]
["t0",0,null,"pf:  x",{"$f":"IF($E$2=1,GUYAN!F79,IF($E$2=2,GUYAN!I79,GUYAN!L79))","v":15},null,null,{"$f":"H20/H21","v":1.3734152197669325},{"$f":"I20/I21","v":1.3734152197669316},null,null,"CM-1",{"$f":"MMULT(E7:F8,M19:N20)","v":0.01152694610778443},-0.0125]
["dt",{"$f":"HOME!$U$5","v":0.1},null,"x",{"$f":"IF($E$2=1,GUYAN!F80,IF($E$2=2,GUYAN!I80,GUYAN!L80))","v":-5},{"$nulls":7},-0.007335329341317365,0.0125]
[{"$nulls":9},"F"]
[{"$nulls":3},"v",{"$f":"IF($E$2=1,GUYAN!F82,IF($E$2=2,GUYAN!I82,GUYAN!L82))","v":0},null,"A=",{"$f":"E7-$E$16^2*E4","v":-13.593367346938775},{"$f":"F7-$E$16^2*F4","v":-0.025},{"$f":"E13","v":15.714285714285714},null,"KM-1",{"$f":"MMULT(E10:F11,M19:N20)","v":0.1059880239520958},-0.1]
[{"$nulls":3},"v",{"$f":"IF($E$2=1,GUYAN!F83,IF($E$2=2,GUYAN!I83,GUYAN!L83))","v":0},null,null,{"$f":"E8-$E$16^2*E5","v":-0.025},{"$f":"F8-$E$16^2*F5","v":-7.975},{"$f":"E14","v":30},null,null,-0.05868263473053892,0.1]
["F1",{"$f":"IF($E$2=1,GUYAN!F86,IF('2DOF'!$E$2=2,GUYAN!I86,GUYAN!L86))","v":0},{"$f":"IF($E$2=1,GUYAN!G86,IF('2DOF'!$E$2=2,GUYAN!J86,GUYAN!M86))","v":0}]
["F2",{"$f":"IF($E$2=1,GUYAN!F87,IF('2DOF'!$E$2=2,GUYAN!I87,GUYAN!L87))","v":0},{"$f":"IF($E$2=1,GUYAN!G87,IF('2DOF'!$E$2=2,GUYAN!J87,GUYAN!M87))","v":0},{"$nulls":4},{"$f":"MINVERSE(H25:I26)","v":-0.07356571332291965},2.3061352138846285E-4,{"$f":"MMULT(H28:I29,J25:J26)","v":-1.1491142322899408},"qp1"]
[{"$nulls":3},"pfhez","x0","v0",null,2.3061352138846285E-4,-0.1253925724561799,-3.7581532469207213,"qp2"]
["allgrabbed",null,null,"q1",{"$f":"J28*SIN($E$17)","v":-1.1462356857445828},{"$f":"J28*$E$16*COS($E$17)","v":-0.1625702503774423}]
["x1",null,null,"q2",{"$f":"J29*SIN($E$17)","v":-3.7487390226931687},{"$f":"J29*$E$16*COS($E$17)","v":-0.5316824882511271},null,"F_pre","F_man"]
["x2",{"$nulls":6},{"$f":"J25","v":15.714285714285714},{"$f":"C27","v":0}]
[{"$nulls":7},{"$f":"J26","v":30},{"$f":"C28","v":0}]
[{"$nulls":6},"STATIC CASE"]
["plot rk",{"$f":"CALC!B40","v":0}]
["plot an",{"$f":"CALC!B41","v":0},{"$nulls":3},"C-1",{"$f":"MINVERSE(E7:F8)","v":70.00000000000001},70,{"$f":"MMULT(G36:H37,H32:H33)","v":3200}]
["plot inf",{"$f":"CALC!B42","v":1},{"$nulls":4},70.00000000000001,110,4400]
["plot until",{"$f":"CALC!B43","v":100}]
[{"$nulls":7},"man",{"$f":"MMULT(G36:H37,I32:I33)","v":0}]
["STATIC",{"$f":"CALC!B45","v":0},{"$nulls":6},0]

{"sheet":"ANIMATION","index":5,"n_rows":1203,"n_cols":20,"rows_kept":1203}
["X1",{"$f":"IF(CALC!C1=1,CALC!AM4,CALC!CB3)","v":-10},{"$nulls":6},{"$f":"HOME!O5","v":10},{"$nulls":4},{"$f":"HOME!P5","v":10},{"$nulls":4},{"$f":"HOME!Q5","v":10}]
["X2",{"$f":"IF(CALC!C1=1,CALC!AN4,CALC!CC3)","v":15},{"$nulls":3},"spring1",{"$f":"HOME!O6","v":0.2},"VIRSPRI",{"$f":"I1*360","v":3600},{"$f":"HOME!O7","v":2},"spring2",{"$f":"HOME!P6","v":0.2},"VIRSPRI",{"$f":"N1*360","v":3600},{"$f":"HOME!P7","v":2},"spring3",{"$f":"HOME!Q6","v":0.2},"VIRSPRI",{"$f":"S1*360","v":3600},{"$f":"HOME!Q7","v":2}]
["X3",{"$f":"IF(CALC!C1=1,CALC!AO4,CALC!CD3)","v":-5},{"$nulls":3},0,0,{"$f":"-1+COS(F3*PI()/180)+G3","v":0},{"$f":"(F3/$I$2)*($D$8-$D$7)+COS(F3*PI()/180)+$D$7-1","v":5},{"$f":"$J$2*SIN(F3*PI()/180)+$B$18","v":4.5},0,0,{"$f":"-1+COS(K3*PI()/180)+L3","v":0},{"$f":"(K3/$N$2)*($D$13-$D$12)+COS(K3*PI()/180)+$D$12-1","v":48.99999999999994},{"$f":"$O$2*SIN(K3*PI()/180)+$B$19","v":4.5},0,0,{"$f":"-1+COS(P3*PI()/180)+Q3","v":0},{"$f":"(P3/$S$2)*($D$18-$D$17)+COS(P3*PI()/180)+$D$17-1","v":127.99999999999989},{"$f":"$T$2*SIN(P3*PI()/180)+$B$20","v":4.5}]
["origo",{"$f":"HOME!AC35","v":0},{"$nulls":3},{"$f":"IF(F3<$I$2,F3+30,NA())","v":30},{"$f":"G3+$G$2","v":0.2},{"$f":"-1+COS(F4*PI()/180)+G4","v":0.06602540378443872},{"$f":"(F4/$I$2)*($D$8-$D$7)+COS(F4*PI()/180)+$D$7-1","v":4.982692070451105},{"$f":"$J$2*SIN(F4*PI()/180)+$B$18","v":5.5},{"$f":"IF(K3<$N$2,K3+30,NA())","v":30},{"$f":"L3+$L$2","v":0.2},{"$f":"-1+COS(K4*PI()/180)+L4","v":0.06602540378443872},{"$f":"(K4/$N$2)*($D$13-$D$12)+COS(K4*PI()/180)+$D$12-1","v":49.274358737117716},{"$f":"$O$2*SIN(K4*PI()/180)+$B$19","v":5.5},{"$f":"IF(P3<$S$2,P3+30,NA())","v":30},{"$f":"Q3+$G$2","v":0.2},{"$f":"-1+COS(P4*PI()/180)+Q4","v":0.06602540378443872},{"$f":"(P4/$S$2)*($D$18-$D$17)+COS(P4*PI()/180)+$D$17-1","v":127.89935873711767},{"$f":"$T$2*SIN(P4*PI()/180)+$B$20","v":5.5}]
["L1",{"$f":"HOME!O3","v":5},"Xsb1_l",{"$f":"B4+B5","v":5},null,60,0.4,-0.09999999999999987,4.7333333333333325,6.232050807568877,{"$f":"IF(K4<$N$2,K4+30,NA())","v":60},{"$f":"L4+$L$2","v":0.4},-0.09999999999999987,49.316666666666606,6.232050807568877,{"$f":"IF(P4<$S$2,P4+30,NA())","v":60},0.4,-0.09999999999999987,127.56666666666655,6.232050807568877]
["R1",{"$f":"VLOOKUP(I2,F3:H1203,3)","v":23.999999999999947},"Xsb1_r",{"$f":"B4+B5+B6","v":28.999999999999947},null,90,0.6000000000000001,-0.3999999999999998,4.349999999999999,6.5,90,0.6000000000000001,-0.3999999999999998,49.224999999999945,6.5,90,0.6000000000000001,-0.3999999999999998,127.09999999999988,6.5]
["L2",{"$f":"HOME!O4","v":5},"X1_l",{"$f":"D5","v":5},null,120,0.8,-0.6999999999999997,3.966666666666665,6.232050807568878,120,0.8,-0.6999999999999997,49.133333333333276,6.232050807568878,120,0.8,-0.6999999999999997,126.63333333333321,6.232050807568878]
["K1",{"$f":"HOME!O9","v":20},"X1_r",{"$f":"B4+B5+B6+B1","v":18.999999999999947},null,150,1,-0.8660254037844388,3.717307929548892,5.5,150,1,-0.8660254037844388,49.175641262882166,5.5,150,1,-0.8660254037844388,126.30064126288211,5.5]
["L3",{"$f":"HOME!P3","v":5},{"$nulls":3},180,1.2,-0.8,3.6999999999999975,4.5,180,1.2,-0.8,49.44999999999994,4.5,180,1.2,-0.8,126.19999999999989,4.5]
["R2",{"$f":"VLOOKUP(N2,K3:M1203,3)","v":23.999999999999947},"Xsb2_l",{"$f":"SUM(B4:B9)","v":58.99999999999994},null,210,1.4,-0.4660254037844387,3.9506412628822254,3.5,210,1.4,-0.4660254037844387,49.992307929548836,3.5,210,1.4,-0.4660254037844387,126.36730792954877,3.5]
["L4",{"$f":"HOME!P4","v":5},"Xsb2_r",{"$f":"D10+B10","v":82.99999999999989},null,240,1.5999999999999999,0.09999999999999942,4.433333333333329,2.7679491924311233,240,1.5999999999999999,0.09999999999999942,50.76666666666661,2.7679491924311233,240,1.5999999999999999,0.09999999999999942,126.76666666666655,2.7679491924311233]
["K2",{"$f":"HOME!P9","v":20},"X2_l",{"$f":"D10+B1","v":48.99999999999994},null,270,1.7999999999999998,0.7999999999999996,5.049999999999995,2.5,270,1.7999999999999998,0.7999999999999996,51.67499999999994,2.5,270,1.7999999999999998,0.7999999999999996,127.29999999999987,2.5]
["L5",{"$f":"HOME!Q3","v":5},"X2_r",{"$f":"D11+B2","v":97.99999999999989},null,300,1.9999999999999998,1.5,5.6666666666666625,2.767949192431123,300,1.9999999999999998,1.5,52.58333333333327,2.767949192431123,300,1.9999999999999998,1.5,127.83333333333323,2.767949192431123]
["R3",{"$f":"VLOOKUP(S2,P3:R1203,3)","v":23.999999999999947},{"$nulls":3},330,2.1999999999999997,2.066025403784438,6.149358737117767,3.499999999999999,330,2.1999999999999997,2.066025403784438,53.357692070451044,3.499999999999999,330,2.1999999999999997,2.066025403784438,128.23269207045098,3.499999999999999]
["L6",{"$f":"HOME!Q4","v":5},"Xsb3_l",{"$f":"SUM(B4:B13)","v":112.99999999999989},null,360,2.4,2.4,6.399999999999995,4.499999999999999,360,2.4,2.4,53.899999999999935,4.499999999999999,360,2.4,2.4,128.3999999999999,4.499999999999999]
["K3",{"$f":"HOME!Q9","v":20},"Xsb3_r",{"$f":"D15+B14","v":136.99999999999983},null,390,2.6,2.466025403784439,6.3826920704511,5.499999999999998,390,2.6,2.466025403784439,54.17435873711771,5.499999999999998,390,2.6,2.466025403784439,128.29935873711764,5.499999999999998]
[null,null,"X3_l",{"$f":"D15+B2","v":127.99999999999989},null,420,2.8000000000000003,2.3,6.133333333333327,6.232050807568878,420,2.8000000000000003,2.3,54.216666666666605,6.232050807568878,420,2.8000000000000003,2.3,127.96666666666655,6.232050807568878]
["Hs1",{"$f":"HOME!O8","v":4.5},"X3_r",{"$f":"D16+B3","v":131.99999999999983},null,450,3.0000000000000004,2.000000000000001,5.749999999999994,6.5,450,3.0000000000000004,2.000000000000001,54.124999999999936,6.5,450,3.0000000000000004,2.000000000000001,127.49999999999989,6.5]
["Hs2",{"$f":"HOME!P8","v":4.5},{"$nulls":3},480,3.2000000000000006,1.7000000000000015,5.36666666666666,6.2320508075688785,480,3.2000000000000006,1.7000000000000015,54.03333333333327,6.2320508075688785,480,3.2000000000000006,1.7000000000000015,127.03333333333322,6.2320508075688785]
["Hs3",{"$f":"HOME!Q8","v":4.5},{"$nulls":3},510,3.400000000000001,1.533974596215562,5.117307929548887,5.5,510,3.400000000000001,1.533974596215562,54.075641262882165,5.5,510,3.400000000000001,1.533974596215562,126.7006412628821,5.5]
[{"$nulls":5},540,3.600000000000001,1.600000000000001,5.0999999999999925,4.500000000000001,540,3.600000000000001,1.600000000000001,54.34999999999994,4.500000000000001,540,3.600000000000001,1.600000000000001,126.59999999999988,4.500000000000001]
["kb1",{"$f":"HOME!O10","v":1.5},{"$nulls":3},570,3.800000000000001,1.9339745962155628,5.3506412628822195,3.4999999999999987,570,3.800000000000001,1.9339745962155628,54.89230792954883,3.4999999999999987,570,3.800000000000001,1.9339745962155628,126.76730792954878,3.4999999999999987]
["kb2",{"$f":"HOME!P10","v":1.5},{"$nulls":3},600,4.000000000000001,2.500000000000001,5.833333333333324,2.7679491924311224,600,4.000000000000001,2.500000000000001,55.6666666666666,2.7679491924311224,600,4.000000000000001,2.500000000000001,127.16666666666654,2.7679491924311224]
["kb3",{"$f":"HOME!Q10","v":1.5},{"$nulls":3},630,4.200000000000001,3.2000000000000006,6.44999999999999,2.5,630,4.200000000000001,3.2000000000000006,56.57499999999993,2.5,630,4.200000000000001,3.2000000000000006,127.69999999999987,2.5]
[{"$nulls":5},660,4.400000000000001,3.9000000000000004,7.066666666666656,2.7679491924311215,660,4.400000000000001,3.9000000000000004,57.48333333333326,2.7679491924311215,660,4.400000000000001,3.9000000000000004,128.2333333333332,2.7679491924311215]
["kt1",{"$f":"HOME!O11","v":8},{"$nulls":3},690,4.600000000000001,4.46602540378444,7.549358737117762,3.5,690,4.600000000000001,4.46602540378444,58.25769207045104,3.5,690,4.600000000000001,4.46602540378444,128.632692070451,3.5]
["kt2",{"$f":"HOME!P11","v":8},{"$nulls":3},720,4.800000000000002,4.800000000000002,7.79999999999999,4.499999999999999,720,4.800000000000002,4.800000000000002,58.79999999999993,4.499999999999999,720,4.800000000000002,4.800000000000002,128.79999999999987,4.499999999999999]
["kt3",{"$f":"HOME!Q11","v":8},{"$nulls":3},750,5.000000000000002,4.866025403784441,7.782692070451095,5.499999999999998,750,5.000000000000002,4.866025403784441,59.074358737117706,5.499999999999998,750,5.000000000000002,4.866025403784441,128.69935873711765,5.499999999999998]
[{"$nulls":5},780,5.200000000000002,4.700000000000004,7.533333333333323,6.232050807568876,780,5.200000000000002,4.700000000000004,59.1166666666666,6.232050807568876,780,5.200000000000002,4.700000000000004,128.36666666666653,6.232050807568876]
[{"$nulls":5},810,5.400000000000002,4.400000000000005,7.14999999999999,6.5,810,5.400000000000002,4.400000000000005,59.024999999999935,6.5,810,5.400000000000002,4.400000000000005,127.89999999999986,6.5]
["plot:","x","y",null,null,840,5.600000000000002,4.100000000000001,6.766666666666653,6.232050807568877,840,5.600000000000002,4.100000000000001,58.933333333333266,6.232050807568877,840,5.600000000000002,4.100000000000001,127.4333333333332,6.232050807568877]
["L1",{"$f":"B4","v":0},{"$f":"B18","v":4.5},null,null,870,5.8000000000000025,3.933974596215564,6.517307929548882,5.5,870,5.8000000000000025,3.933974596215564,58.97564126288216,5.5,870,5.8000000000000025,3.933974596215564,127.1006412628821,5.5]
[null,{"$f":"D7","v":5},{"$f":"B18","v":4.5},null,null,900,6.000000000000003,4.000000000000003,6.499999999999987,4.500000000000001,900,6.000000000000003,4.000000000000003,59.24999999999993,4.500000000000001,900,6.000000000000003,4.000000000000003,126.99999999999987,4.500000000000001]
[{"$nulls":5},930,6.200000000000003,4.333974596215564,6.750641262882214,3.500000000000002,930,6.200000000000003,4.333974596215564,59.79230792954883,3.500000000000002,930,6.200000000000003,4.333974596215564,127.16730792954877,3.500000000000002]
["L2",{"$f":"D8","v":18.999999999999947},{"$f":"B18","v":4.5},null,null,960,6.400000000000003,4.900000000000001,7.2333333333333165,2.7679491924311246,960,6.400000000000003,4.900000000000001,60.56666666666659,2.7679491924311246,960,6.400000000000003,4.900000000000001,127.56666666666655,2.7679491924311246]
[null,{"$f":"D8+B7","v":23.999999999999947},{"$f":"B18","v":4.5},null,null,990,6.600000000000003,5.600000000000004,7.849999999999987,2.5,990,6.600000000000003,5.600000000000004,61.47499999999993,2.5,990,6.600000000000003,5.600000000000004,128.09999999999988,2.5]
[{"$nulls":5},1020,6.800000000000003,6.300000000000004,8.466666666666653,2.7679491924311233,1020,6.800000000000003,6.300000000000004,62.38333333333326,2.7679491924311233,1020,6.800000000000003,6.300000000000004,128.6333333333332,2.7679491924311233]
["k1",{"$f":"B36","v":23.999999999999947},{"$f":"B22","v":1.5},null,null,1050,7.0000000000000036,6.866025403784442,8.949358737117755,3.5,1050,7.0000000000000036,6.866025403784442,63.157692070451034,3.5,1050,7.0000000000000036,6.866025403784442,129.03269207045096,3.5]
[null,{"$f":"B38+B8","v":43.99999999999994},{"$f":"B22","v":1.5},null,null,1080,7.200000000000004,7.200000000000004,9.199999999999985,4.499999999999998,1080,7.200000000000004,7.200000000000004,63.69999999999993,4.499999999999998,1080,7.200000000000004,7.200000000000004,129.19999999999987,4.499999999999998]
[null,{"$f":"B39","v":43.99999999999994},{"$f":"B26","v":8},null,null,1110,7.400000000000004,7.266025403784441,9.182692070451088,5.5000000000000036,1110,7.400000000000004,7.266025403784441,63.9743587371177,5.5000000000000036,1110,7.400000000000004,7.266025403784441,129.09935873711763,5.5000000000000036]
[null,{"$f":"B36","v":23.999999999999947},{"$f":"B26","v":8},null,null,1140,7.600000000000004,7.100000000000003,8.933333333333314,6.2320508075688785,1140,7.600000000000004,7.100000000000003,64.0166666666666,6.2320508075688785,1140,7.600000000000004,7.100000000000003,128.76666666666654,6.2320508075688785]
[null,{"$f":"B41","v":23.999999999999947},{"$f":"B22","v":1.5},null,null,1170,7.800000000000004,6.800000000000003,8.549999999999983,6.5,1170,7.800000000000004,6.800000000000003,63.924999999999926,6.5,1170,7.800000000000004,6.800000000000003,128.29999999999987,6.5]
[{"$nulls":5},1200,8.000000000000004,6.5000000000000036,8.166666666666648,6.232050807568877,1200,8.000000000000004,6.5000000000000036,63.83333333333326,6.232050807568877,1200,8.000000000000004,6.5000000000000036,127.8333333333332,6.232050807568877]
["L3",{"$f":"B36+B8","v":43.99999999999994},{"$f":"B19","v":4.5},null,null,1230,8.200000000000003,6.3339745962155645,7.917307929548876,5.5,1230,8.200000000000003,6.3339745962155645,63.875641262882155,5.5,1230,8.200000000000003,6.3339745962155645,127.50064126288208,5.5]
[null,{"$f":"B44+B9","v":48.99999999999994},{"$f":"B19","v":4.5},null,null,1260,8.400000000000002,6.400000000000002,7.899999999999981,4.500000000000002,1260,8.400000000000002,6.400000000000002,64.14999999999992,4.500000000000002,1260,8.400000000000002,6.400000000000002,127.39999999999986,4.500000000000002]
[{"$nulls":5},1290,8.600000000000001,6.733974596215562,8.150641262882209,3.5000000000000027,1290,8.600000000000001,6.733974596215562,64.69230792954882,3.5000000000000027,1290,8.600000000000001,6.733974596215562,127.56730792954875,3.5000000000000027]
["L4",{"$f":"D13","v":97.99999999999989},{"$f":"B19","v":4.5},null,null,1320,8.8,7.299999999999999,8.633333333333312,2.767949192431125,1320,8.8,7.299999999999999,65.46666666666658,2.767949192431125,1320,8.8,7.299999999999999,127.96666666666653,2.767949192431125]
[null,{"$f":"D13+B11","v":102.99999999999989},{"$f":"B19","v":4.5},null,null,1350,9,8,9.249999999999982,2.5,1350,9,8,66.37499999999991,2.5,1350,9,8,128.49999999999986,2.5]
[{"$nulls":5},1380,9.2,8.7,9.866666666666646,2.7679491924311233,1380,9.2,8.7,67.28333333333326,2.7679491924311233,1380,9.2,8.7,129.0333333333332,2.7679491924311233]
["k2",{"$f":"B48","v":102.99999999999989},{"$f":"B23","v":1.5},null,null,1410,9.399999999999999,9.266025403784438,10.34935873711775,3.499999999999999,1410,9.399999999999999,9.266025403784438,68.05769207045103,3.499999999999999,1410,9.399999999999999,9.266025403784438,129.43269207045097,3.499999999999999]
[null,{"$f":"B50+B12","v":122.99999999999989},{"$f":"B23","v":1.5},null,null,1440,9.599999999999998,9.599999999999998,10.59999999999998,4.499999999999998,1440,9.599999999999998,9.599999999999998,68.59999999999992,4.499999999999998,1440,9.599999999999998,9.599999999999998,129.59999999999985,4.499999999999998]
[null,{"$f":"B51","v":122.99999999999989},{"$f":"B27","v":8},null,null,1470,9.799999999999997,9.666025403784436,10.582692070451085,5.499999999999997,1470,9.799999999999997,9.666025403784436,68.87435873711769,5.499999999999997,1470,9.799999999999997,9.666025403784436,129.49935873711763,5.499999999999997]
[null,{"$f":"B48","v":102.99999999999989},{"$f":"B27","v":8},null,null,1500,9.999999999999996,9.499999999999998,10.333333333333314,6.232050807568875,1500,9.999999999999996,9.499999999999998,68.91666666666659,6.232050807568875,1500,9.999999999999996,9.499999999999998,129.16666666666654,6.232050807568875]
[null,{"$f":"B48","v":102.99999999999989},{"$f":"B23","v":1.5},null,null,1530,10.199999999999996,9.2,9.94999999999998,6.5,1530,10.199999999999996,9.2,68.82499999999992,6.5,1530,10.199999999999996,9.2,128.69999999999987,6.5]
[{"$nulls":5},1560,10.399999999999995,8.899999999999999,9.566666666666645,6.23205080756888,1560,10.399999999999995,8.899999999999999,68.73333333333326,6.23205080756888,1560,10.399999999999995,8.899999999999999,128.2333333333332,6.23205080756888]
["L5",{"$f":"B48+B12","v":122.99999999999989},{"$f":"B20","v":4.5},null,null,1590,10.599999999999994,8.733974596215557,9.317307929548873,5.500000000000007,1590,10.599999999999994,8.733974596215557,68.77564126288215,5.500000000000007,1590,10.599999999999994,8.733974596215557,127.90064126288209,5.500000000000007]
[null,{"$f":"B56+B13","v":127.99999999999989},{"$f":"B20","v":4.5},null,null,1620,10.799999999999994,8.799999999999994,9.299999999999976,4.500000000000009,1620,10.799999999999994,8.799999999999994,69.04999999999993,4.500000000000009,1620,10.799999999999994,8.799999999999994,127.79999999999987,4.500000000000009]
[{"$nulls":5},1650,10.999999999999993,9.133974596215555,9.550641262882205,3.499999999999997,1650,10.999999999999993,9.133974596215555,69.59230792954881,3.499999999999997,1650,10.999999999999993,9.133974596215555,127.96730792954875,3.499999999999997]
["L6",{"$f":"D18","v":131.99999999999983},{"$f":"B20","v":4.5},null,null,1680,11.199999999999992,9.699999999999994,10.03333333333331,2.7679491924311215,1680,11.199999999999992,9.699999999999994,70.36666666666659,2.7679491924311215,1680,11.199999999999992,9.699999999999994,128.36666666666653,2.7679491924311215]
[null,{"$f":"D18+B15","v":136.99999999999983},{"$f":"B20","v":4.5},null,null,1710,11.399999999999991,10.399999999999991,10.649999999999975,2.5,1710,11.399999999999991,10.399999999999991,71.27499999999992,2.5,1710,11.399999999999991,10.399999999999991,128.89999999999986,2.5]
[{"$nulls":5},1740,11.59999999999999,11.09999999999999,11.26666666666664,2.767949192431123,1740,11.59999999999999,11.09999999999999,72.18333333333325,2.767949192431123,1740,11.59999999999999,11.09999999999999,129.4333333333332,2.767949192431123]
["k3",{"$f":"B60","v":136.99999999999983},{"$f":"B24","v":1.5},null,null,1770,11.79999999999999,11.666025403784428,11.749358737117745,3.499999999999999,1770,11.79999999999999,11.666025403784428,72.95769207045102,3.499999999999999,1770,11.79999999999999,11.666025403784428,129.83269207045097,3.499999999999999]
[null,{"$f":"B60+B16","v":156.99999999999983},{"$f":"B24","v":1.5},null,null,1800,11.99999999999999,11.99999999999999,11.999999999999973,4.499999999999997,1800,11.99999999999999,11.99999999999999,73.49999999999991,4.499999999999997,1800,11.99999999999999,11.99999999999999,129.99999999999986,4.499999999999997]
[null,{"$f":"B63","v":156.99999999999983},{"$f":"B28","v":8},null,null,1830,12.199999999999989,12.066025403784428,11.982692070451078,5.4999999999999964,1830,12.199999999999989,12.066025403784428,73.7743587371177,5.4999999999999964,1830,12.199999999999989,12.066025403784428,129.89935873711764,5.4999999999999964]
[null,{"$f":"B62","v":136.99999999999983},{"$f":"B28","v":8},null,null,1860,12.399999999999988,11.89999999999999,11.73333333333331,6.232050807568875,1860,12.399999999999988,11.89999999999999,73.81666666666659,6.232050807568875,1860,12.399999999999988,11.89999999999999,129.56666666666652,6.232050807568875]
[null,{"$f":"B62","v":136.99999999999983},{"$f":"B24","v":1.5},null,null,1890,12.599999999999987,11.599999999999994,11.349999999999978,6.5,1890,12.599999999999987,11.599999999999994,73.72499999999992,6.5,1890,12.599999999999987,11.599999999999994,129.09999999999985,6.5]
[{"$nulls":5},1920,12.799999999999986,11.29999999999999,10.966666666666642,6.232050807568881,1920,12.799999999999986,11.29999999999999,73.63333333333324,6.232050807568881,1920,12.799999999999986,11.29999999999999,128.63333333333318,6.232050807568881]
[null,0.15,{"$nulls":3},{"$f":"IF(F67<$I$2,F67+30,NA())","v":1950},{"$f":"G67+$G$2","v":12.999999999999986},{"$f":"-1+COS(F68*PI()/180)+G68","v":11.133974596215548},{"$f":"(F68/$I$2)*($D$8-$D$7)+COS(F68*PI()/180)+$D$7-1","v":10.717307929548866},{"$f":"$J$2*SIN(F68*PI()/180)+$B$18","v":5.500000000000002},1950,12.999999999999986,{"$f":"-1+COS(K68*PI()/180)+L68","v":11.133974596215548},{"$f":"(K68/$N$2)*($D$13-$D$12)+COS(K68*PI()/180)+$D$12-1","v":73.67564126288214},{"$f":"$O$2*SIN(K68*PI()/180)+$B$19","v":5.500000000000002},1950,{"$f":"Q67+$G$2","v":12.999999999999986},{"$f":"-1+COS(P68*PI()/180)+Q68","v":11.133974596215548},{"$f":"(P68/$S$2)*($D$18-$D$17)+COS(P68*PI()/180)+$D$17-1","v":128.3006412628821},{"$f":"$T$2*SIN(P68*PI()/180)+$B$20","v":5.500000000000002}]
["wheels",{"$f":"B38+B68*B8","v":26.999999999999947},{"$f":"B22/2","v":0.75},null,null,1980,13.199999999999985,11.199999999999985,10.69999999999997,4.499999999999996,{"$f":"IF(K68<$N$2,K68+30,NA())","v":1980},{"$f":"L68+$L$2","v":13.199999999999985},11.199999999999985,73.94999999999992,4.499999999999996,{"$f":"IF(P68<$S$2,P68+30,NA())","v":1980},13.199999999999985,11.199999999999985,128.19999999999985,4.499999999999996]
[null,{"$f":"B39-B68*B8","v":40.99999999999994},{"$f":"B22/2","v":0.75},null,null,2010,13.399999999999984,11.533974596215545,10.950641262882197,3.5000000000000036,2010,13.399999999999984,11.533974596215545,74.4923079295488,3.5000000000000036,2010,13.399999999999984,11.533974596215545,128.36730792954876,3.5000000000000036]
[null,{"$f":"B50+B68*B12","v":105.99999999999989},{"$f":"B22/2","v":0.75},null,null,2040,13.599999999999984,12.099999999999984,11.433333333333305,2.7679491924311215,2040,13.599999999999984,12.099999999999984,75.26666666666658,2.7679491924311215,2040,13.599999999999984,12.099999999999984,128.7666666666665,2.7679491924311215]
[null,{"$f":"B51-B68*B12","v":119.99999999999989},{"$f":"B22/2","v":0.75},null,null,2070,13.799999999999983,12.79999999999998,12.049999999999965,2.5,2070,13.799999999999983,12.79999999999998,76.1749999999999,2.5,2070,13.799999999999983,12.79999999999998,129.29999999999984,2.5]
[null,{"$f":"B62+B68*B16","v":139.99999999999983},{"$f":"B22/2","v":0.75},null,null,2100,13.999999999999982,13.499999999999982,12.666666666666636,2.7679491924311224,2100,13.999999999999982,13.499999999999982,77.08333333333324,2.7679491924311224,2100,13.999999999999982,13.499999999999982,129.8333333333332,2.7679491924311224]
[null,{"$f":"B63-B68*B16","v":153.99999999999983},{"$f":"B22/2","v":0.75},null,null,2130,14.199999999999982,14.066025403784417,13.149358737117737,3.4999999999999925,2130,14.199999999999982,14.066025403784417,77.85769207045101,3.4999999999999925,2130,14.199999999999982,14.066025403784417,130.23269207045095,3.4999999999999925]
[{"$nulls":5},2160,14.39999999999998,14.39999999999998,13.399999999999968,4.499999999999997,2160,14.39999999999998,14.39999999999998,78.3999999999999,4.499999999999997,2160,14.39999999999998,14.39999999999998,130.39999999999986,4.499999999999997]
["lines",0.1,{"$nulls":3},2190,14.59999999999998,14.466025403784421,13.382692070451075,5.49999999999999,2190,14.59999999999998,14.466025403784421,78.67435873711767,5.49999999999999,2190,14.59999999999998,14.466025403784421,130.29935873711761,5.49999999999999]
[{"$nulls":5},2220,14.79999999999998,14.299999999999976,13.133333333333297,6.232050807568882,2220,14.79999999999998,14.299999999999976,78.71666666666657,6.232050807568882,2220,14.79999999999998,14.299999999999976,129.96666666666653,6.232050807568882]
["zero",{"$f":"B4","v":0},0,null,null,2250,14.999999999999979,13.999999999999979,12.749999999999966,6.5,2250,14.999999999999979,13.999999999999979,78.62499999999991,6.5,2250,14.999999999999979,13.999999999999979,129.49999999999986,6.5]
[null,{"$f":"B4","v":0},{"$f":"B26+B26*B76","v":8.8},null,null,2280,15.199999999999978,13.699999999999974,12.366666666666628,6.232050807568874,2280,15.199999999999978,13.699999999999974,78.53333333333323,6.232050807568874,2280,15.199999999999978,13.699999999999974,129.0333333333332,6.232050807568874]
[{"$nulls":5},2310,15.399999999999977,13.53397459621554,12.117307929548863,5.500000000000002,2310,15.399999999999977,13.53397459621554,78.57564126288214,5.500000000000002,2310,15.399999999999977,13.53397459621554,128.70064126288207,5.500000000000002]
["neutral1",{"$f":"D6+B7+B8/2","v":43.99999999999994},{"$f":"C98","v":-2},null,null,2340,15.599999999999977,13.599999999999977,12.099999999999966,4.4999999999999964,2340,15.599999999999977,13.599999999999977,78.84999999999991,4.4999999999999964,2340,15.599999999999977,13.599999999999977,128.59999999999985,4.4999999999999964]
[null,{"$f":"B81","v":43.99999999999994},{"$f":"B26+B26*B76","v":8.8},null,null,2370,15.799999999999976,13.933974596215537,12.350641262882192,3.5000000000000036,2370,15.799999999999976,13.933974596215537,79.39230792954879,3.5000000000000036,2370,15.799999999999976,13.933974596215537,128.76730792954874,3.5000000000000036]
[{"$nulls":5},2400,15.999999999999975,14.499999999999975,12.833333333333297,2.767949192431122,2400,15.999999999999975,14.499999999999975,80.16666666666657,2.767949192431122,2400,15.999999999999975,14.499999999999975,129.16666666666652,2.767949192431122]
["neutral2",{"$f":"D11+B11+B12/2","v":97.99999999999989},{"$f":"C98","v":-2},null,null,2430,16.199999999999974,15.19999999999997,13.44999999999996,2.5,2430,16.199999999999974,15.19999999999997,81.0749999999999,2.5,2430,16.199999999999974,15.19999999999997,129.69999999999985,2.5]
[null,{"$f":"B84","v":97.99999999999989},{"$f":"B26+B26*B76","v":8.8},null,null,2460,16.399999999999974,15.899999999999974,14.066666666666631,2.7679491924311224,2460,16.399999999999974,15.899999999999974,81.98333333333323,2.7679491924311224,2460,16.399999999999974,15.899999999999974,130.23333333333318,2.7679491924311224]
[{"$nulls":5},2490,16.599999999999973,16.46602540378441,14.549358737117732,3.499999999999992,2490,16.599999999999973,16.46602540378441,82.757692070451,3.499999999999992,2490,16.599999999999973,16.46602540378441,130.63269207045096,3.499999999999992]
["neutral3",{"$f":"D16+B15+B16/2","v":151.99999999999983},{"$f":"C98","v":-2},null,null,2520,16.799999999999972,16.799999999999972,14.799999999999962,4.4999999999999964,2520,16.799999999999972,16.799999999999972,83.2999999999999,4.4999999999999964,2520,16.799999999999972,16.799999999999972,130.79999999999984,4.4999999999999964]
[null,{"$f":"B87","v":151.99999999999983},{"$f":"B26+B26*B76","v":8.8},null,null,2550,16.99999999999997,16.86602540378441,14.782692070451066,5.500000000000002,2550,16.99999999999997,16.86602540378441,83.57435873711768,5.500000000000002,2550,16.99999999999997,16.86602540378441,130.69935873711762,5.500000000000002]
[{"$nulls":5},2580,17.19999999999997,16.699999999999974,14.533333333333298,6.232050807568874,2580,17.19999999999997,16.699999999999974,83.61666666666656,6.232050807568874,2580,17.19999999999997,16.699999999999974,130.3666666666665,6.232050807568874]
[null,"position",{"$nulls":3},2610,17.39999999999997,16.39999999999997,14.149999999999961,6.5,2610,17.39999999999997,16.39999999999997,83.52499999999989,6.5,2610,17.39999999999997,16.39999999999997,129.89999999999984,6.5]
["hands",{"$f":"IF(CALC!B36=0,NA(),D8+B7+B8/2)","v":{"$error":"#N/A"}},{"$f":"IF(CALC!B36=0,NA(),B22+(B26-B22)/2)","v":{"$error":"#N/A"}},null,null,2640,17.59999999999997,16.099999999999973,13.76666666666663,6.232050807568881,2640,17.59999999999997,16.099999999999973,83.43333333333324,6.232050807568881,2640,17.59999999999997,16.099999999999973,129.4333333333332,6.232050807568881]
[null,{"$f":"IF(CALC!B37=0,NA(),D13+B11+B12/2)","v":{"$error":"#N/A"}},{"$f":"IF(CALC!B37=0,NA(),B23+(B27-B23)/2)","v":{"$error":"#N/A"}},null,null,2670,17.79999999999997,15.933974596215531,13.517307929548856,5.500000000000002,2670,17.79999999999997,15.933974596215531,83.47564126288214,5.500000000000002,2670,17.79999999999997,15.933974596215531,129.10064126288208,5.500000000000002]
[null,{"$f":"IF(CALC!B38=0,NA(),D18+B15+B16/2)","v":{"$error":"#N/A"}},{"$f":"IF(CALC!B38=0,NA(),B24+(B28-B24)/2)","v":{"$error":"#N/A"}},null,null,2700,17.999999999999968,15.999999999999968,13.499999999999961,4.4999999999999964,2700,17.999999999999968,15.999999999999968,83.7499999999999,4.4999999999999964,2700,17.999999999999968,15.999999999999968,128.99999999999983,4.4999999999999964]
[{"$nulls":5},2730,18.199999999999967,16.333974596215526,13.750641262882187,3.5000000000000044,2730,18.199999999999967,16.333974596215526,84.2923079295488,3.5000000000000044,2730,18.199999999999967,16.333974596215526,129.16730792954874,3.5000000000000044]
["RKerror",{"$f":"IF(CALC!C1=1,IF(OR(ABS(B1)>100000000,ABS(B2)>100000000,ABS(B3)>100000000),B84,NA()),NA())","v":{"$error":"#N/A"}},{"$f":"IF(CALC!C1=1,IF(OR(ABS(B1)>100000000,ABS(B2)>100000000,ABS(B3)>100000000),C85*0.8,NA()),NA())","v":{"$error":"#N/A"}},null,null,2760,18.399999999999967,16.899999999999967,14.233333333333293,2.7679491924311224,2760,18.399999999999967,16.899999999999967,85.06666666666658,2.7679491924311224,2760,18.399999999999967,16.899999999999967,129.56666666666652,2.7679491924311224]
["Aerror2",{"$f":"IF(CALC!C1=2,IF(ISNUMBER(CALC!CB3),NA(),B84),NA())","v":{"$error":"#N/A"}},{"$f":"IF(CALC!C1=2,IF(ISNUMBER(CALC!CB3),NA(),C85*0.8),NA())","v":{"$error":"#N/A"}},null,null,2790,18.599999999999966,17.599999999999962,14.849999999999955,2.5,2790,18.599999999999966,17.599999999999962,85.9749999999999,2.5,2790,18.599999999999966,17.599999999999962,130.09999999999985,2.5]
["forces",{"$f":"IF(HOME!AI1=0,HOME!E7,HOME!F37)","v":20},"pos",null,null,2820,18.799999999999965,18.299999999999965,15.466666666666626,2.767949192431122,2820,18.799999999999965,18.299999999999965,86.88333333333324,2.767949192431122,2820,18.799999999999965,18.299999999999965,130.63333333333318,2.767949192431122]
[null,{"$f":"IF(HOME!AI2=0,HOME!G7,HOME!N37)","v":10},-2,null,null,2850,18.999999999999964,18.866025403784402,15.949358737117727,3.4999999999999916,2850,18.999999999999964,18.866025403784402,87.65769207045099,3.4999999999999916,2850,18.999999999999964,18.866025403784402,131.03269207045093,3.4999999999999916]
[null,{"$f":"IF(HOME!AI3=0,HOME!I7,HOME!V37)","v":30},{"$nulls":3},2880,19.199999999999964,19.199999999999964,16.19999999999996,4.4999999999999964,2880,19.199999999999964,19.199999999999964,88.1999999999999,4.4999999999999964,2880,19.199999999999964,19.199999999999964,131.19999999999985,4.4999999999999964]
["la",{"$f":"((B87-B84)+(B84-B81)/2)","v":80.99999999999991},{"$nulls":3},2910,19.399999999999963,19.266025403784404,16.182692070451065,5.499999999999989,2910,19.399999999999963,19.266025403784404,88.47435873711768,5.499999999999989,2910,19.399999999999963,19.266025403784404,131.09935873711763,5.499999999999989]
["scale",0.4,{"$nulls":3},2940,19.599999999999962,19.099999999999966,15.933333333333294,6.232050807568874,2940,19.599999999999962,19.099999999999966,88.51666666666657,6.232050807568874,2940,19.599999999999962,19.099999999999966,130.7666666666665,6.232050807568874]
[null,{"$f":"B100*B101","v":32.39999999999997},{"$nulls":3},2970,19.79999999999996,18.79999999999996,15.549999999999955,6.5,2970,19.79999999999996,18.79999999999996,88.4249999999999,6.5,2970,19.79999999999996,18.79999999999996,130.29999999999984,6.5]
["Fmax",{"$f":"IF(MAX(B97:B99)=0,NA(),MAX(B97:B99))","v":30},{"$nulls":3},3000,19.99999999999996,18.499999999999964,15.166666666666629,6.232050807568882,3000,19.99999999999996,18.499999999999964,88.33333333333323,6.232050807568882,3000,19.99999999999996,18.499999999999964,129.83333333333317,6.232050807568882]
["scalefactor",{"$f":"B102/B103","v":1.079999999999999},{"$nulls":3},3030,20.19999999999996,18.333974596215523,14.917307929548851,5.500000000000003,3030,20.19999999999996,18.333974596215523,88.37564126288211,5.500000000000003,3030,20.19999999999996,18.333974596215523,129.50064126288206,5.500000000000003]
[{"$nulls":5},3060,20.39999999999996,18.39999999999996,14.899999999999954,4.5000000000000115,3060,20.39999999999996,18.39999999999996,88.64999999999989,4.5000000000000115,3060,20.39999999999996,18.39999999999996,129.39999999999984,4.5000000000000115]
[{"$nulls":5},3090,20.59999999999996,18.733974596215518,15.150641262882182,3.5000000000000044,3090,20.59999999999996,18.733974596215518,89.19230792954878,3.5000000000000044,3090,20.59999999999996,18.733974596215518,129.56730792954872,3.5000000000000044]
["scaledF",{"$f":"B97*$B$104","v":21.59999999999998},{"$nulls":3},3120,20.799999999999958,19.29999999999995,15.633333333333283,2.7679491924311295,3120,20.799999999999958,19.29999999999995,89.96666666666655,2.7679491924311295,3120,20.799999999999958,19.29999999999995,129.9666666666665,2.7679491924311295]
[null,{"$f":"B98*$B$104","v":10.79999999999999},{"$nulls":3},3150,20.999999999999957,19.999999999999954,16.24999999999995,2.5,3150,20.999999999999957,19.999999999999954,90.87499999999989,2.5,3150,20.999999999999957,19.999999999999954,130.49999999999983,2.5]
[null,32.39999999999997,{"$nulls":3},3180,21.199999999999957,20.69999999999995,16.86666666666661,2.7679491924311144,3180,21.199999999999957,20.69999999999995,91.78333333333322,2.7679491924311144,3180,21.199999999999957,20.69999999999995,131.03333333333316,2.7679491924311144]
[{"$nulls":5},3210,21.399999999999956,21.266025403784397,17.349358737117726,3.5000000000000036,3210,21.399999999999956,21.266025403784397,92.557692070451,3.5000000000000036,3210,21.399999999999956,21.266025403784397,131.43269207045094,3.5000000000000036]
["msF",{"$f":"HOME!I37*ANIMATION!$B$104","v":-18.17577327185055},{"$nulls":3},3240,21.599999999999955,21.599999999999955,17.59999999999995,4.499999999999981,3240,21.599999999999955,21.599999999999955,93.0999999999999,4.499999999999981,3240,21.599999999999955,21.599999999999955,131.59999999999982,4.499999999999981]
[null,{"$f":"HOME!Q37*ANIMATION!B104","v":10.772945855323778},{"$nulls":3},3270,21.799999999999955,21.666025403784392,17.582692070451056,5.500000000000002,3270,21.799999999999955,21.666025403784392,93.37435873711766,5.500000000000002,3270,21.799999999999955,21.666025403784392,131.4993587371176,5.500000000000002]
[null,{"$f":"HOME!Y37*ANIMATION!B104","v":18.294416137999125},{"$nulls":3},3300,21.999999999999954,21.49999999999995,17.33333333333328,6.232050807568881,3300,21.999999999999954,21.49999999999995,93.41666666666656,6.232050807568881,3300,21.999999999999954,21.49999999999995,131.1666666666665,6.232050807568881]
[{"$nulls":5},3330,22.199999999999953,21.199999999999953,16.949999999999953,6.5,3330,22.199999999999953,21.199999999999953,93.3249999999999,6.5,3330,22.199999999999953,21.199999999999953,130.69999999999985,6.5]
["plot",{"$f":"B81","v":43.99999999999994},{"$f":"C81","v":-2},null,null,3360,22.399999999999952,20.89999999999995,16.566666666666613,6.232050807568875,3360,22.399999999999952,20.89999999999995,93.23333333333323,6.232050807568875,3360,22.399999999999952,20.89999999999995,130.23333333333318,6.232050807568875]
[null,{"$f":"B81+B111","v":25.824226728149394},{"$f":"C81","v":-2},null,null,3390,22.59999999999995,20.733974596215514,16.317307929548846,5.500000000000003,3390,22.59999999999995,20.733974596215514,93.27564126288212,5.500000000000003,3390,22.59999999999995,20.733974596215514,129.90064126288206,5.500000000000003]
[null,{"$f":"B84","v":97.99999999999989},{"$f":"C84","v":-2},null,null,3420,22.79999999999995,20.79999999999995,16.299999999999947,4.499999999999997,3420,22.79999999999995,20.79999999999995,93.54999999999988,4.499999999999997,3420,22.79999999999995,20.79999999999995,129.79999999999984,4.499999999999997]
[null,{"$f":"B84+B112","v":108.77294585532367},{"$f":"C84","v":-2},null,null,3450,22.99999999999995,21.13397459621551,16.550641262882177,3.5000000000000053,3450,22.99999999999995,21.13397459621551,94.09230792954878,3.5000000000000053,3450,22.99999999999995,21.13397459621551,129.96730792954872,3.5000000000000053]
[null,{"$f":"B87","v":151.99999999999983},{"$f":"C87","v":-2},null,null,3480,23.19999999999995,21.69999999999995,17.03333333333328,2.767949192431123,3480,23.19999999999995,21.69999999999995,94.86666666666656,2.767949192431123,3480,23.19999999999995,21.69999999999995,130.3666666666665,2.767949192431123]
[null,{"$f":"B87+B113","v":170.29441613799895},{"$f":"C87","v":-2},null,null,3510,23.39999999999995,22.399999999999945,17.64999999999994,2.5,3510,23.39999999999995,22.399999999999945,95.77499999999988,2.5,3510,23.39999999999995,22.399999999999945,130.89999999999984,2.5]
[{"$nulls":5},3540,23.599999999999948,23.099999999999948,18.266666666666612,2.7679491924311215,3540,23.599999999999948,23.099999999999948,96.68333333333322,2.7679491924311215,3540,23.599999999999948,23.099999999999948,131.43333333333317,2.7679491924311215]
[null,0.2,10,null,null,3570,23.799999999999947,23.66602540378439,18.74935873711772,3.500000000000003,3570,23.799999999999947,23.66602540378439,97.457692070451,3.500000000000003,3570,23.799999999999947,23.66602540378439,131.83269207045095,3.500000000000003]
["arr",{"$f":"B116-B111*B122*COS(C122*PI()/180)","v":29.404155215171492},{"$f":"C116+B111*B122*SIN(C122*PI()/180)","v":-2.6312379812688294},null,null,3600,23.999999999999947,23.999999999999947,18.999999999999947,4.499999999999995,3600,23.999999999999947,23.999999999999947,97.99999999999989,4.499999999999995,3600,23.999999999999947,23.999999999999947,131.99999999999983,4.499999999999995]
[null,{"$f":"B116","v":25.824226728149394},{"$f":"C116","v":-2},null,null,{"$error":"#N/A"},24.199999999999946,{"$error":"#N/A"},{"$error":"#N/A"},{"$error":"#N/A"},{"$error":"#N/A"},24.199999999999946,{"$error":"#N/A"},{"$error":"#N/A"},{"$error":"#N/A"},{"$error":"#N/A"},24.199999999999946,{"$error":"#N/A"},{"$error":"#N/A"},{"$error":"#N/A"}]
[null,{"$f":"B116-B111*B122*COS(C122*PI()/180)","v":29.404155215171492},{"$f":"C116-B111*B122*SIN(C122*PI()/180)","v":-1.3687620187311704},null,null,{"$error":"#N/A"},24.399999999999945,{"$error":"#N/A"},{"$error":"#N/A"},{"$error":"#N/A"},{"$error":"#N/A"},24.399999999999945,{"$error":"#N/A"},{"$error":"#N/A"},{"$error":"#N/A"},{"$error":"#N/A"},24.399999999999945,{"$error":"#N/A"},{"$error":"#N/A"},{"$error":"#N/A"}]
[{"$nulls":5},{"$error":"#N/A"},24.599999999999945,{"$error":"#N/A"},{"$error":"#N/A"},{"$error":"#N/A"},{"$error":"#N/A"},24.599999999999945,{"$error":"#N/A"},{"$error":"#N/A"},{"$error":"#N/A"},{"$error":"#N/A"},24.599999999999945,{"$error":"#N/A"},{"$error":"#N/A"},{"$error":"#N/A"}]
[null,{"$f":"B118-B112*B122*COS(C122*PI()/180)","v":106.65108973510296},{"$f":"C118+B112*B122*SIN(C122*PI()/180)","v":-1.625859516823703},null,null,{"$error":"#N/A"},24.799999999999944,{"$error":"#N/A"},{"$error":"#N/A"},{"$error":"#N/A"},{"$error":"#N/A"},24.799999999999944,{"$error":"#N/A"},{"$error":"#N/A"},{"$error":"#N/A"},{"$error":"#N/A"},24.799999999999944,{"$error":"#N/A"},{"$error":"#N/A"},{"$error":"#N/A"}]
[null,{"$f":"B118","v":108.77294585532367},{"$f":"C118","v":-2},null,null,{"$error":"#N/A"},24.999999999999943,{"$error":"#N/A"},{"$error":"#N/A"},{"$error":"#N/A"},{"$error":"#N/A"},24.999999999999943,{"$error":"#N/A"},{"$error":"#N/A"},{"$error":"#N/A"},{"$error":"#N/A"},24.999999999999943,{"$error":"#N/A"},{"$error":"#N/A"},{"$error":"#N/A"}]
[null,{"$f":"B118-B112*B122*COS(C122*PI()/180)","v":106.65108973510296},{"$f":"C118-B112*B122*SIN(C122*PI()/180)","v":-2.374140483176297},null,null,{"$error":"#N/A"},25.199999999999942,{"$error":"#N/A"},{"$error":"#N/A"},{"$error":"#N/A"},{"$error":"#N/A"},25.199999999999942,{"$error":"#N/A"},{"$error":"#N/A"},{"$error":"#N/A"},{"$error":"#N/A"},25.199999999999942,{"$error":"#N/A"},{"$error":"#N/A"},{"$error":"#N/A"}]
[{"$nulls":5},{"$error":"#N/A"},25.39999999999994,{"$error":"#N/A"},{"$error":"#N/A"},{"$error":"#N/A"},{"$error":"#N/A"},25.39999999999994,{"$error":"#N/A"},{"$error":"#N/A"},{"$error":"#N/A"},{"$error":"#N/A"},25.39999999999994,{"$error":"#N/A"},{"$error":"#N/A"},{"$error":"#N/A"}]
[null,{"$f":"B120-B113*B122*COS(C122*PI()/180)","v":166.69111956809232},{"$f":"C120+B113*B122*SIN(C122*PI()/180)","v":-1.364641595231194},null,null,{"$error":"#N/A"},25.59999999999994,{"$error":"#N/A"},{"$error":"#N/A"},{"$error":"#N/A"},{"$error":"#N/A"},25.59999999999994,{"$error":"#N/A"},{"$error":"#N/A"},{"$error":"#N/A"},{"$error":"#N/A"},25.59999999999994,{"$error":"#N/A"},{"$error":"#N/A"},{"$error":"#N/A"}]
[null,{"$f":"B120","v":170.29441613799895},{"$f":"C120","v":-2},null,null,{"$f":"IF(F131<$I$2,F131+30,NA())","v":{"$error":"#N/A"}},{"$f":"G131+$G$2","v":25.79999999999994},{"$f":"-1+COS(F132*PI()/180)+G132","v":{"$error":"#N/A"}},{"$f":"(F132/$I$2)*($D$8-$D$7)+COS(F132*PI()/180)+$D$7-1","v":{"$error":"#N/A"}},{"$f":"$J$2*SIN(F132*PI()/180)+$B$18","v":{"$error":"#N/A"}},{"$error":"#N/A"},25.79999999999994,{"$f":"-1+COS(K132*PI()/180)+L132","v":{"$error":"#N/A"}},{"$f":"(K132/$N$2)*($D$13-$D$12)+COS(K132*PI()/180)+$D$12-1","v":{"$error":"#N/A"}},{"$f":"$O$2*SIN(K132*PI()/180)+$B$19","v":{"$error":"#N/A"}},{"$error":"#N/A"},{"$f":"Q131+$G$2","v":25.79999999999994},{"$f":"-1+COS(P132*PI()/180)+Q132","v":{"$error":"#N/A"}},{"$f":"(P132/$S$2)*($D$18-$D$17)+COS(P132*PI()/180)+$D$17-1","v":{"$error":"#N/A"}},{"$f":"$T$2*SIN(P132*PI()/180)+$B$20","v":{"$error":"#N/A"}}]
[null,{"$f":"B120-B113*B122*COS(C122*PI()/180)","v":166.69111956809232},{"$f":"C120-B113*B122*SIN(C122*PI()/180)","v":-2.635358404768806},null,null,{"$error":"#N/A"},25.99999999999994,{"$error":"#N/A"},{"$error":"#N/A"},{"$error":"#N/A"},{"$f":"IF(K132<$N$2,K132+30,NA())","v":{"$error":"#N/A"}},{"$f":"L132+$L$2","v":25.99999999999994},{"$error":"#N/A"},{"$error":"#N/A"},{"$error":"#N/A"},{"$f":"IF(P132<$S$2,P132+30,NA())","v":{"$error":"#N/A"}},25.99999999999994,{"$error":"#N/A"},{"$error":"#N/A"},{"$error":"#N/A"}]
[{"$nulls":5},{"$error":"#N/A"},26.19999999999994,{"$error":"#N/A"},{"$error":"#N/A"},{"$error":"#N/A"},{"$error":"#N/A"},26.19999999999994,{"$error":"#N/A"},{"$error":"#N/A"},{"$error":"#N/A"},{"$error":"#N/A"},26.19999999999994,{"$error":"#N/A"},{"$error":"#N/A"},{"$error":"#N/A"}]
[null,{"$f":"MAX(B39,B51,B63,)","v":156.99999999999983},{"$nulls":3},{"$error":"#N/A"},26.399999999999938,{"$error":"#N/A"},{"$error":"#N/A"},{"$error":"#N/A"},{"$error":"#N/A"},26.399999999999938,{"$error":"#N/A"},{"$error":"#N/A"},{"$error":"#N/A"},{"$error":"#N/A"},26.399999999999938,{"$error":"#N/A"},{"$error":"#N/A"},{"$error":"#N/A"}]
[null,{"$f":"MIN(0,B38,B50,B62,)","v":0},{"$nulls":3},{"$error":"#N/A"},26.599999999999937,{"$error":"#N/A"},{"$error":"#N/A"},{"$error":"#N/A"},{"$error":"#N/A"},26.599999999999937,{"$error":"#N/A"},{"$error":"#N/A"},{"$error":"#N/A"},{"$error":"#N/A"},26.599999999999937,{"$error":"#N/A"},{"$error":"#N/A"},{"$error":"#N/A"}]
[{"$nulls":5},{"$error":"#N/A"},26.799999999999937,{"$error":"#N/A"},{"$error":"#N/A"},{"$error":"#N/A"},{"$error":"#N/A"},26.799999999999937,{"$error":"#N/A"},{"$error":"#N/A"},{"$error":"#N/A"},{"$error":"#N/A"},26.799999999999937,{"$error":"#N/A"},{"$error":"#N/A"},{"$error":"#N/A"}]
[{"$nulls":5},{"$error":"#N/A"},26.999999999999936,{"$error":"#N/A"},{"$error":"#N/A"},{"$error":"#N/A"},{"$error":"#N/A"},26.999999999999936,{"$error":"#N/A"},{"$error":"#N/A"},{"$error":"#N/A"},{"$error":"#N/A"},26.999999999999936,{"$error":"#N/A"},{"$error":"#N/A"},{"$error":"#N/A"}]
[{"$nulls":5},{"$error":"#N/A"},27.199999999999935,{"$error":"#N/A"},{"$error":"#N/A"},{"$error":"#N/A"},{"$error":"#N/A"},27.199999999999935,{"$error":"#N/A"},{"$error":"#N/A"},{"$error":"#N/A"},{"$error":"#N/A"},27.199999999999935,{"$error":"#N/A"},{"$error":"#N/A"},{"$error":"#N/A"}]
[{"$nulls":5},{"$error":"#N/A"},27.399999999999935,{"$error":"#N/A"},{"$error":"#N/A"},{"$error":"#N/A"},{"$error":"#N/A"},27.399999999999935,{"$error":"#N/A"},{"$error":"#N/A"},{"$error":"#N/A"},{"$error":"#N/A"},27.399999999999935,{"$error":"#N/A"},{"$error":"#N/A"},{"$error":"#N/A"}]
[{"$nulls":5},{"$error":"#N/A"},27.599999999999934,{"$error":"#N/A"},{"$error":"#N/A"},{"$error":"#N/A"},{"$error":"#N/A"},27.599999999999934,{"$error":"#N/A"},{"$error":"#N/A"},{"$error":"#N/A"},{"$error":"#N/A"},27.599999999999934,{"$error":"#N/A"},{"$error":"#N/A"},{"$error":"#N/A"}]
["GUYAN",{"$f":"HOME!AJ50","v":0},{"$nulls":3},{"$error":"#N/A"},27.799999999999933,{"$error":"#N/A"},{"$error":"#N/A"},{"$error":"#N/A"},{"$error":"#N/A"},27.799999999999933,{"$error":"#N/A"},{"$error":"#N/A"},{"$error":"#N/A"},{"$error":"#N/A"},27.799999999999933,{"$error":"#N/A"},{"$error":"#N/A"},{"$error":"#N/A"}]
["case",{"$f":"'2DOF'!E2","v":3},{"$nulls":3},{"$error":"#N/A"},27.999999999999932,{"$error":"#N/A"},{"$error":"#N/A"},{"$error":"#N/A"},{"$error":"#N/A"},27.999999999999932,{"$error":"#N/A"},{"$error":"#N/A"},{"$error":"#N/A"},{"$error":"#N/A"},27.999999999999932,{"$error":"#N/A"},{"$error":"#N/A"},{"$error":"#N/A"}]
["neut",1,2,null,null,{"$error":"#N/A"},28.199999999999932,{"$error":"#N/A"},{"$error":"#N/A"},{"$error":"#N/A"},{"$error":"#N/A"},28.199999999999932,{"$error":"#N/A"},{"$error":"#N/A"},{"$error":"#N/A"},{"$error":"#N/A"},28.199999999999932,{"$error":"#N/A"},{"$error":"#N/A"},{"$error":"#N/A"}]
[{"$nulls":5},{"$error":"#N/A"},28.39999999999993,{"$error":"#N/A"},{"$error":"#N/A"},{"$error":"#N/A"},{"$error":"#N/A"},28.39999999999993,{"$error":"#N/A"},{"$error":"#N/A"},{"$error":"#N/A"},{"$error":"#N/A"},28.39999999999993,{"$error":"#N/A"},{"$error":"#N/A"},{"$error":"#N/A"}]
["neutral",{"$f":"IF(B142=0,NA(),IF(B143=1,B81,IF(B143=2,B81,B84)))","v":{"$error":"#N/A"}},{"$f":"IF(B143=1,B84,IF(B143=2,B87,B87))","v":151.99999999999983},null,null,{"$error":"#N/A"},28.59999999999993,{"$error":"#N/A"},{"$error":"#N/A"},{"$error":"#N/A"},{"$error":"#N/A"},28.59999999999993,{"$error":"#N/A"},{"$error":"#N/A"},{"$error":"#N/A"},{"$error":"#N/A"},28.59999999999993,{"$error":"#N/A"},{"$error":"#N/A"},{"$error":"#N/A"}]
["actual",{"$f":"B146+'2DOF'!V4","v":{"$error":"#N/A"}},{"$f":"C146+'2DOF'!W4","v":146.99999999999983},null,null,{"$error":"#N/A"},28.79999999999993,{"$error":"#N/A"},{"$error":"#N/A"},{"$error":"#N/A"},{"$error":"#N/A"},28.79999999999993,{"$error":"#N/A"},{"$error":"#N/A"},{"$error":"#N/A"},{"$error":"#N/A"},28.79999999999993,{"$error":"#N/A"},{"$error":"#N/A"},{"$error":"#N/A"}]
["K",{"$f":"IF(B143=1,B8,IF(B143=2,B8,B12))","v":20},{"$f":"IF(B142=0,NA(),IF(B143=1,B12,IF(B143=2,B16,B16)))","v":{"$error":"#N/A"}},null,null,{"$error":"#N/A"},28.99999999999993,{"$error":"#N/A"},{"$error":"#N/A"},{"$error":"#N/A"},{"$error":"#N/A"},28.99999999999993,{"$error":"#N/A"},{"$error":"#N/A"},{"$error":"#N/A"},{"$error":"#N/A"},28.99999999999993,{"$error":"#N/A"},{"$error":"#N/A"},{"$error":"#N/A"}]
["Kb",{"$f":"IF(B143=1,B22,IF(B143=2,B22,B23))","v":1.5},{"$f":"IF(B143=1,B23,IF(B143=2,B24,B24))","v":1.5},null,null,{"$error":"#N/A"},29.19999999999993,{"$error":"#N/A"},{"$error":"#N/A"},{"$error":"#N/A"},{"$error":"#N/A"},29.19999999999993,{"$error":"#N/A"},{"$error":"#N/A"},{"$error":"#N/A"},{"$error":"#N/A"},29.19999999999993,{"$error":"#N/A"},{"$error":"#N/A"},{"$error":"#N/A"}]
["Kt",{"$f":"IF(B143=1,B26,IF(B143=2,B26,B27))","v":8},{"$f":"IF(B143=1,B27,IF(B143=2,B28,B28))","v":8},null,null,{"$error":"#N/A"},29.399999999999928,{"$error":"#N/A"},{"$error":"#N/A"},{"$error":"#N/A"},{"$error":"#N/A"},29.399999999999928,{"$error":"#N/A"},{"$error":"#N/A"},{"$error":"#N/A"},{"$error":"#N/A"},29.399999999999928,{"$error":"#N/A"},{"$error":"#N/A"},{"$error":"#N/A"}]
[{"$nulls":5},{"$error":"#N/A"},29.599999999999927,{"$error":"#N/A"},{"$error":"#N/A"},{"$error":"#N/A"},{"$error":"#N/A"},29.599999999999927,{"$error":"#N/A"},{"$error":"#N/A"},{"$error":"#N/A"},{"$error":"#N/A"},29.599999999999927,{"$error":"#N/A"},{"$error":"#N/A"},{"$error":"#N/A"}]
[{"$nulls":5},{"$error":"#N/A"},29.799999999999926,{"$error":"#N/A"},{"$error":"#N/A"},{"$error":"#N/A"},{"$error":"#N/A"},29.799999999999926,{"$error":"#N/A"},{"$error":"#N/A"},{"$error":"#N/A"},{"$error":"#N/A"},29.799999999999926,{"$error":"#N/A"},{"$error":"#N/A"},{"$error":"#N/A"}]
["K1",{"$f":"B147-B148/2","v":{"$error":"#N/A"}},{"$f":"IF(B142=0,NA(),B149)","v":{"$error":"#N/A"}},null,null,{"$error":"#N/A"},29.999999999999925,{"$error":"#N/A"},{"$error":"#N/A"},{"$error":"#N/A"},{"$error":"#N/A"},29.999999999999925,{"$error":"#N/A"},{"$error":"#N/A"},{"$error":"#N/A"},{"$error":"#N/A"},29.999999999999925,{"$error":"#N/A"},{"$error":"#N/A"},{"$error":"#N/A"}]
[null,{"$f":"IF(B142=0,NA(),B153)","v":{"$error":"#N/A"}},{"$f":"IF(B142=0,NA(),B150)","v":{"$error":"#N/A"}},null,null,{"$error":"#N/A"},30.199999999999925,{"$error":"#N/A"},{"$error":"#N/A"},{"$error":"#N/A"},{"$error":"#N/A"},30.199999999999925,{"$error":"#N/A"},{"$error":"#N/A"},{"$error":"#N/A"},{"$error":"#N/A"},30.199999999999925,{"$error":"#N/A"},{"$error":"#N/A"},{"$error":"#N/A"}]
[null,{"$f":"IF(B142=0,NA(),B147+B148/2)","v":{"$error":"#N/A"}},{"$f":"IF(B142=0,NA(),B150)","v":{"$error":"#N/A"}},null,null,{"$error":"#N/A"},30.399999999999924,{"$error":"#N/A"},{"$error":"#N/A"},{"$error":"#N/A"},{"$error":"#N/A"},30.399999999999924,{"$error":"#N/A"},{"$error":"#N/A"},{"$error":"#N/A"},{"$error":"#N/A"},30.399999999999924,{"$error":"#N/A"},{"$error":"#N/A"},{"$error":"#N/A"}]
[null,{"$f":"IF(B142=0,NA(),B155)","v":{"$error":"#N/A"}},{"$f":"IF(B142=0,NA(),B149)","v":{"$error":"#N/A"}},null,null,{"$error":"#N/A"},30.599999999999923,{"$error":"#N/A"},{"$error":"#N/A"},{"$error":"#N/A"},{"$error":"#N/A"},30.599999999999923,{"$error":"#N/A"},{"$error":"#N/A"},{"$error":"#N/A"},{"$error":"#N/A"},30.599999999999923,{"$error":"#N/A"},{"$error":"#N/A"},{"$error":"#N/A"}]
[null,{"$f":"IF(B142=0,NA(),B153)","v":{"$error":"#N/A"}},{"$f":"IF(B142=0,NA(),C153)","v":{"$error":"#N/A"}},null,null,{"$error":"#N/A"},30.799999999999923,{"$error":"#N/A"},{"$error":"#N/A"},{"$error":"#N/A"},{"$error":"#N/A"},30.799999999999923,{"$error":"#N/A"},{"$error":"#N/A"},{"$error":"#N/A"},{"$error":"#N/A"},30.799999999999923,{"$error":"#N/A"},{"$error":"#N/A"},{"$error":"#N/A"}]
[{"$nulls":5},{"$error":"#N/A"},30.999999999999922,{"$error":"#N/A"},{"$error":"#N/A"},{"$error":"#N/A"},{"$error":"#N/A"},30.999999999999922,{"$error":"#N/A"},{"$error":"#N/A"},{"$error":"#N/A"},{"$error":"#N/A"},30.999999999999922,{"$error":"#N/A"},{"$error":"#N/A"},{"$error":"#N/A"}]
["K2",{"$f":"IF(B142=0,NA(),C147-C148/2)","v":{"$error":"#N/A"}},{"$f":"IF(B142=0,NA(),C149)","v":{"$error":"#N/A"}},null,null,{"$error":"#N/A"},31.19999999999992,{"$error":"#N/A"},{"$error":"#N/A"},{"$error":"#N/A"},{"$error":"#N/A"},31.19999999999992,{"$error":"#N/A"},{"$error":"#N/A"},{"$error":"#N/A"},{"$error":"#N/A"},31.19999999999992,{"$error":"#N/A"},{"$error":"#N/A"},{"$error":"#N/A"}]
[null,{"$f":"IF(B142=0,NA(),B159)","v":{"$error":"#N/A"}},{"$f":"IF(B142=0,NA(),C150)","v":{"$error":"#N/A"}},null,null,{"$error":"#N/A"},31.39999999999992,{"$error":"#N/A"},{"$error":"#N/A"},{"$error":"#N/A"},{"$error":"#N/A"},31.39999999999992,{"$error":"#N/A"},{"$error":"#N/A"},{"$error":"#N/A"},{"$error":"#N/A"},31.39999999999992,{"$error":"#N/A"},{"$error":"#N/A"},{"$error":"#N/A"}]
[null,{"$f":"IF(B142=0,NA(),C147+C148/2)","v":{"$error":"#N/A"}},{"$f":"IF(B142=0,NA(),C150)","v":{"$error":"#N/A"}},null,null,{"$error":"#N/A"},31.59999999999992,{"$error":"#N/A"},{"$error":"#N/A"},{"$error":"#N/A"},{"$error":"#N/A"},31.59999999999992,{"$error":"#N/A"},{"$error":"#N/A"},{"$error":"#N/A"},{"$error":"#N/A"},31.59999999999992,{"$error":"#N/A"},{"$error":"#N/A"},{"$error":"#N/A"}]
[null,{"$f":"IF(B142=0,NA(),B161)","v":{"$error":"#N/A"}},{"$f":"IF(B142=0,NA(),C149)","v":{"$error":"#N/A"}},null,null,{"$error":"#N/A"},31.79999999999992,{"$error":"#N/A"},{"$error":"#N/A"},{"$error":"#N/A"},{"$error":"#N/A"},31.79999999999992,{"$error":"#N/A"},{"$error":"#N/A"},{"$error":"#N/A"},{"$error":"#N/A"},31.79999999999992,{"$error":"#N/A"},{"$error":"#N/A"},{"$error":"#N/A"}]
[null,{"$f":"IF(B142=0,NA(),B159)","v":{"$error":"#N/A"}},{"$f":"IF(B142=0,NA(),C159)","v":{"$error":"#N/A"}},null,null,{"$error":"#N/A"},31.99999999999992,{"$error":"#N/A"},{"$error":"#N/A"},{"$error":"#N/A"},{"$error":"#N/A"},31.99999999999992,{"$error":"#N/A"},{"$error":"#N/A"},{"$error":"#N/A"},{"$error":"#N/A"},31.99999999999992,{"$error":"#N/A"},{"$error":"#N/A"},{"$error":"#N/A"}]
[{"$nulls":5},{"$error":"#N/A"},32.19999999999992,{"$error":"#N/A"},{"$error":"#N/A"},{"$error":"#N/A"},{"$error":"#N/A"},32.19999999999992,{"$error":"#N/A"},{"$error":"#N/A"},{"$error":"#N/A"},{"$error":"#N/A"},32.19999999999992,{"$error":"#N/A"},{"$error":"#N/A"},{"$error":"#N/A"}]
[null,0.15,{"$nulls":3},{"$error":"#N/A"},32.39999999999992,{"$error":"#N/A"},{"$error":"#N/A"},{"$error":"#N/A"},{"$error":"#N/A"},32.39999999999992,{"$error":"#N/A"},{"$error":"#N/A"},{"$error":"#N/A"},{"$error":"#N/A"},32.39999999999992,{"$error":"#N/A"},{"$error":"#N/A"},{"$error":"#N/A"}]
["wheels",{"$f":"B153+B165*B148","v":{"$error":"#N/A"}},{"$f":"B149/2","v":0.75},null,null,{"$error":"#N/A"},32.59999999999992,{"$error":"#N/A"},{"$error":"#N/A"},{"$error":"#N/A"},{"$error":"#N/A"},32.59999999999992,{"$error":"#N/A"},{"$error":"#N/A"},{"$error":"#N/A"},{"$error":"#N/A"},32.59999999999992,{"$error":"#N/A"},{"$error":"#N/A"},{"$error":"#N/A"}]
[null,{"$f":"B155-B165*B148","v":{"$error":"#N/A"}},{"$f":"B149/2","v":0.75},null,null,{"$error":"#N/A"},32.799999999999926,{"$error":"#N/A"},{"$error":"#N/A"},{"$error":"#N/A"},{"$error":"#N/A"},32.799999999999926,{"$error":"#N/A"},{"$error":"#N/A"},{"$error":"#N/A"},{"$error":"#N/A"},32.799999999999926,{"$error":"#N/A"},{"$error":"#N/A"},{"$error":"#N/A"}]
[null,{"$f":"B159+B165*C148","v":{"$error":"#N/A"}},{"$f":"C149/2","v":0.75},null,null,{"$error":"#N/A"},32.99999999999993,{"$error":"#N/A"},{"$error":"#N/A"},{"$error":"#N/A"},{"$error":"#N/A"},32.99999999999993,{"$error":"#N/A"},{"$error":"#N/A"},{"$error":"#N/A"},{"$error":"#N/A"},32.99999999999993,{"$error":"#N/A"},{"$error":"#N/A"},{"$error":"#N/A"}]
[null,{"$f":"B161-B165*C148","v":{"$error":"#N/A"}},{"$f":"C149/2","v":0.75},null,null,{"$error":"#N/A"},33.19999999999993,{"$error":"#N/A"},{"$error":"#N/A"},{"$error":"#N/A"},{"$error":"#N/A"},33.19999999999993,{"$error":"#N/A"},{"$error":"#N/A"},{"$error":"#N/A"},{"$error":"#N/A"},33.19999999999993,{"$error":"#N/A"},{"$error":"#N/A"},{"$error":"#N/A"}]
[{"$nulls":5},{"$error":"#N/A"},33.399999999999935,{"$error":"#N/A"},{"$error":"#N/A"},{"$error":"#N/A"},{"$error":"#N/A"},33.399999999999935,{"$error":"#N/A"},{"$error":"#N/A"},{"$error":"#N/A"},{"$error":"#N/A"},33.399999999999935,{"$error":"#N/A"},{"$error":"#N/A"},{"$error":"#N/A"}]
[{"$nulls":5},{"$error":"#N/A"},33.59999999999994,{"$error":"#N/A"},{"$error":"#N/A"},{"$error":"#N/A"},{"$error":"#N/A"},33.59999999999994,{"$error":"#N/A"},{"$error":"#N/A"},{"$error":"#N/A"},{"$error":"#N/A"},33.59999999999994,{"$error":"#N/A"},{"$error":"#N/A"},{"$error":"#N/A"}]
[{"$nulls":5},{"$error":"#N/A"},33.79999999999994,{"$error":"#N/A"},{"$error":"#N/A"},{"$error":"#N/A"},{"$error":"#N/A"},33.79999999999994,{"$error":"#N/A"},{"$error":"#N/A"},{"$error":"#N/A"},{"$error":"#N/A"},33.79999999999994,{"$error":"#N/A"},{"$error":"#N/A"},{"$error":"#N/A"}]
[{"$nulls":5},{"$error":"#N/A"},33.99999999999994,{"$error":"#N/A"},{"$error":"#N/A"},{"$error":"#N/A"},{"$error":"#N/A"},33.99999999999994,{"$error":"#N/A"},{"$error":"#N/A"},{"$error":"#N/A"},{"$error":"#N/A"},33.99999999999994,{"$error":"#N/A"},{"$error":"#N/A"},{"$error":"#N/A"}]
[{"$nulls":5},{"$error":"#N/A"},34.199999999999946,{"$error":"#N/A"},{"$error":"#N/A"},{"$error":"#N/A"},{"$error":"#N/A"},34.199999999999946,{"$error":"#N/A"},{"$error":"#N/A"},{"$error":"#N/A"},{"$error":"#N/A"},34.199999999999946,{"$error":"#N/A"},{"$error":"#N/A"},{"$error":"#N/A"}]
[{"$nulls":5},{"$error":"#N/A"},34.39999999999995,{"$error":"#N/A"},{"$error":"#N/A"},{"$error":"#N/A"},{"$error":"#N/A"},34.39999999999995,{"$error":"#N/A"},{"$error":"#N/A"},{"$error":"#N/A"},{"$error":"#N/A"},34.39999999999995,{"$error":"#N/A"},{"$error":"#N/A"},{"$error":"#N/A"}]
[{"$nulls":5},{"$error":"#N/A"},34.59999999999995,{"$error":"#N/A"},{"$error":"#N/A"},{"$error":"#N/A"},{"$error":"#N/A"},34.59999999999995,{"$error":"#N/A"},{"$error":"#N/A"},{"$error":"#N/A"},{"$error":"#N/A"},34.59999999999995,{"$error":"#N/A"},{"$error":"#N/A"},{"$error":"#N/A"}]
[{"$nulls":5},{"$error":"#N/A"},34.799999999999955,{"$error":"#N/A"},{"$error":"#N/A"},{"$error":"#N/A"},{"$error":"#N/A"},34.799999999999955,{"$error":"#N/A"},{"$error":"#N/A"},{"$error":"#N/A"},{"$error":"#N/A"},34.799999999999955,{"$error":"#N/A"},{"$error":"#N/A"},{"$error":"#N/A"}]
[{"$nulls":5},{"$error":"#N/A"},34.99999999999996,{"$error":"#N/A"},{"$error":"#N/A"},{"$error":"#N/A"},{"$error":"#N/A"},34.99999999999996,{"$error":"#N/A"},{"$error":"#N/A"},{"$error":"#N/A"},{"$error":"#N/A"},34.99999999999996,{"$error":"#N/A"},{"$error":"#N/A"},{"$error":"#N/A"}]
[{"$nulls":5},{"$error":"#N/A"},35.19999999999996,{"$error":"#N/A"},{"$error":"#N/A"},{"$error":"#N/A"},{"$error":"#N/A"},35.19999999999996,{"$error":"#N/A"},{"$error":"#N/A"},{"$error":"#N/A"},{"$error":"#N/A"},35.19999999999996,{"$error":"#N/A"},{"$error":"#N/A"},{"$error":"#N/A"}]
[{"$nulls":5},{"$error":"#N/A"},35.39999999999996,{"$error":"#N/A"},{"$error":"#N/A"},{"$error":"#N/A"},{"$error":"#N/A"},35.39999999999996,{"$error":"#N/A"},{"$error":"#N/A"},{"$error":"#N/A"},{"$error":"#N/A"},35.39999999999996,{"$error":"#N/A"},{"$error":"#N/A"},{"$error":"#N/A"}]
[{"$nulls":5},{"$error":"#N/A"},35.599999999999966,{"$error":"#N/A"},{"$error":"#N/A"},{"$error":"#N/A"},{"$error":"#N/A"},35.599999999999966,{"$error":"#N/A"},{"$error":"#N/A"},{"$error":"#N/A"},{"$error":"#N/A"},35.599999999999966,{"$error":"#N/A"},{"$error":"#N/A"},{"$error":"#N/A"}]
[{"$nulls":5},{"$error":"#N/A"},35.79999999999997,{"$error":"#N/A"},{"$error":"#N/A"},{"$error":"#N/A"},{"$error":"#N/A"},35.79999999999997,{"$error":"#N/A"},{"$error":"#N/A"},{"$error":"#N/A"},{"$error":"#N/A"},35.79999999999997,{"$error":"#N/A"},{"$error":"#N/A"},{"$error":"#N/A"}]
[{"$nulls":5},{"$error":"#N/A"},35.99999999999997,{"$error":"#N/A"},{"$error":"#N/A"},{"$error":"#N/A"},{"$error":"#N/A"},35.99999999999997,{"$error":"#N/A"},{"$error":"#N/A"},{"$error":"#N/A"},{"$error":"#N/A"},35.99999999999997,{"$error":"#N/A"},{"$error":"#N/A"},{"$error":"#N/A"}]
[{"$nulls":5},{"$error":"#N/A"},36.199999999999974,{"$error":"#N/A"},{"$error":"#N/A"},{"$error":"#N/A"},{"$error":"#N/A"},36.199999999999974,{"$error":"#N/A"},{"$error":"#N/A"},{"$error":"#N/A"},{"$error":"#N/A"},36.199999999999974,{"$error":"#N/A"},{"$error":"#N/A"},{"$error":"#N/A"}]
[{"$nulls":5},{"$error":"#N/A"},36.39999999999998,{"$error":"#N/A"},{"$error":"#N/A"},{"$error":"#N/A"},{"$error":"#N/A"},36.39999999999998,{"$error":"#N/A"},{"$error":"#N/A"},{"$error":"#N/A"},{"$error":"#N/A"},36.39999999999998,{"$error":"#N/A"},{"$error":"#N/A"},{"$error":"#N/A"}]
[{"$nulls":5},{"$error":"#N/A"},36.59999999999998,{"$error":"#N/A"},{"$error":"#N/A"},{"$error":"#N/A"},{"$error":"#N/A"},36.59999999999998,{"$error":"#N/A"},{"$error":"#N/A"},{"$error":"#N/A"},{"$error":"#N/A"},36.59999999999998,{"$error":"#N/A"},{"$error":"#N/A"},{"$error":"#N/A"}]
[{"$nulls":5},{"$error":"#N/A"},36.79999999999998,{"$error":"#N/A"},{"$error":"#N/A"},{"$error":"#N/A"},{"$error":"#N/A"},36.79999999999998,{"$error":"#N/A"},{"$error":"#N/A"},{"$error":"#N/A"},{"$error":"#N/A"},36.79999999999998,{"$error":"#N/A"},{"$error":"#N/A"},{"$error":"#N/A"}]
[{"$nulls":5},{"$error":"#N/A"},36.999999999999986,{"$error":"#N/A"},{"$error":"#N/A"},{"$error":"#N/A"},{"$error":"#N/A"},36.999999999999986,{"$error":"#N/A"},{"$error":"#N/A"},{"$error":"#N/A"},{"$error":"#N/A"},36.999999999999986,{"$error":"#N/A"},{"$error":"#N/A"},{"$error":"#N/A"}]
[{"$nulls":5},{"$error":"#N/A"},37.19999999999999,{"$error":"#N/A"},{"$error":"#N/A"},{"$error":"#N/A"},{"$error":"#N/A"},37.19999999999999,{"$error":"#N/A"},{"$error":"#N/A"},{"$error":"#N/A"},{"$error":"#N/A"},37.19999999999999,{"$error":"#N/A"},{"$error":"#N/A"},{"$error":"#N/A"}]
[{"$nulls":5},{"$error":"#N/A"},37.39999999999999,{"$error":"#N/A"},{"$error":"#N/A"},{"$error":"#N/A"},{"$error":"#N/A"},37.39999999999999,{"$error":"#N/A"},{"$error":"#N/A"},{"$error":"#N/A"},{"$error":"#N/A"},37.39999999999999,{"$error":"#N/A"},{"$error":"#N/A"},{"$error":"#N/A"}]
[{"$nulls":5},{"$error":"#N/A"},37.599999999999994,{"$error":"#N/A"},{"$error":"#N/A"},{"$error":"#N/A"},{"$error":"#N/A"},37.599999999999994,{"$error":"#N/A"},{"$error":"#N/A"},{"$error":"#N/A"},{"$error":"#N/A"},37.599999999999994,{"$error":"#N/A"},{"$error":"#N/A"},{"$error":"#N/A"}]
[{"$nulls":5},{"$error":"#N/A"},37.8,{"$error":"#N/A"},{"$error":"#N/A"},{"$error":"#N/A"},{"$error":"#N/A"},37.8,{"$error":"#N/A"},{"$error":"#N/A"},{"$error":"#N/A"},{"$error":"#N/A"},37.8,{"$error":"#N/A"},{"$error":"#N/A"},{"$error":"#N/A"}]
[{"$nulls":5},{"$error":"#N/A"},38,{"$error":"#N/A"},{"$error":"#N/A"},{"$error":"#N/A"},{"$error":"#N/A"},38,{"$error":"#N/A"},{"$error":"#N/A"},{"$error":"#N/A"},{"$error":"#N/A"},38,{"$error":"#N/A"},{"$error":"#N/A"},{"$error":"#N/A"}]
[{"$nulls":5},{"$error":"#N/A"},38.2,{"$error":"#N/A"},{"$error":"#N/A"},{"$error":"#N/A"},{"$error":"#N/A"},38.2,{"$error":"#N/A"},{"$error":"#N/A"},{"$error":"#N/A"},{"$error":"#N/A"},38.2,{"$error":"#N/A"},{"$error":"#N/A"},{"$error":"#N/A"}]
[{"$nulls":5},{"$error":"#N/A"},38.400000000000006,{"$error":"#N/A"},{"$error":"#N/A"},{"$error":"#N/A"},{"$error":"#N/A"},38.400000000000006,{"$error":"#N/A"},{"$error":"#N/A"},{"$error":"#N/A"},{"$error":"#N/A"},38.400000000000006,{"$error":"#N/A"},{"$error":"#N/A"},{"$error":"#N/A"}]
[{"$nulls":5},{"$f":"IF(F195<$I$2,F195+30,NA())","v":{"$error":"#N/A"}},{"$f":"G195+$G$2","v":38.60000000000001},{"$f":"-1+COS(F196*PI()/180)+G196","v":{"$error":"#N/A"}},{"$f":"(F196/$I$2)*($D$8-$D$7)+COS(F196*PI()/180)+$D$7-1","v":{"$error":"#N/A"}},{"$f":"$J$2*SIN(F196*PI()/180)+$B$18","v":{"$error":"#N/A"}},{"$error":"#N/A"},38.60000000000001,{"$f":"-1+COS(K196*PI()/180)+L196","v":{"$error":"#N/A"}},{"$f":"(K196/$N$2)*($D$13-$D$12)+COS(K196*PI()/180)+$D$12-1","v":{"$error":"#N/A"}},{"$f":"$O$2*SIN(K196*PI()/180)+$B$19","v":{"$error":"#N/A"}},{"$error":"#N/A"},{"$f":"Q195+$G$2","v":38.60000000000001},{"$f":"-1+COS(P196*PI()/180)+Q196","v":{"$error":"#N/A"}},{"$f":"(P196/$S$2)*($D$18-$D$17)+COS(P196*PI()/180)+$D$17-1","v":{"$error":"#N/A"}},{"$f":"$T$2*SIN(P196*PI()/180)+$B$20","v":{"$error":"#N/A"}}]
[{"$nulls":5},{"$error":"#N/A"},38.80000000000001,{"$error":"#N/A"},{"$error":"#N/A"},{"$error":"#N/A"},{"$f":"IF(K196<$N$2,K196+30,NA())","v":{"$error":"#N/A"}},{"$f":"L196+$L$2","v":38.80000000000001},{"$error":"#N/A"},{"$error":"#N/A"},{"$error":"#N/A"},{"$f":"IF(P196<$S$2,P196+30,NA())","v":{"$error":"#N/A"}},38.80000000000001,{"$error":"#N/A"},{"$error":"#N/A"},{"$error":"#N/A"}]
[{"$nulls":5},{"$error":"#N/A"},39.000000000000014,{"$error":"#N/A"},{"$error":"#N/A"},{"$error":"#N/A"},{"$error":"#N/A"},39.000000000000014,{"$error":"#N/A"},{"$error":"#N/A"},{"$error":"#N/A"},{"$error":"#N/A"},39.000000000000014,{"$error":"#N/A"},{"$error":"#N/A"},{"$error":"#N/A"}]
[{"$nulls":5},{"$error":"#N/A"},39.20000000000002,{"$error":"#N/A"},{"$error":"#N/A"},{"$error":"#N/A"},{"$error":"#N/A"},39.20000000000002,{"$error":"#N/A"},{"$error":"#N/A"},{"$error":"#N/A"},{"$error":"#N/A"},39.20000000000002,{"$error":"#N/A"},{"$error":"#N/A"},{"$error":"#N/A"}]
[{"$nulls":5},{"$error":"#N/A"},39.40000000000002,{"$error":"#N/A"},{"$error":"#N/A"},{"$error":"#N/A"},{"$error":"#N/A"},39.40000000000002,{"$error":"#N/A"},{"$error":"#N/A"},{"$error":"#N/A"},{"$error":"#N/A"},39.40000000000002,{"$error":"#N/A"},{"$error":"#N/A"},{"$error":"#N/A"}]
[{"$nulls":5},{"$error":"#N/A"},39.60000000000002,{"$error":"#N/A"},{"$error":"#N/A"},{"$error":"#N/A"},{"$error":"#N/A"},39.60000000000002,{"$error":"#N/A"},{"$error":"#N/A"},{"$error":"#N/A"},{"$error":"#N/A"},39.60000000000002,{"$error":"#N/A"},{"$error":"#N/A"},{"$error":"#N/A"}]
[{"$nulls":5},{"$error":"#N/A"},39.800000000000026,{"$error":"#N/A"},{"$error":"#N/A"},{"$error":"#N/A"},{"$error":"#N/A"},39.800000000000026,{"$error":"#N/A"},{"$error":"#N/A"},{"$error":"#N/A"},{"$error":"#N/A"},39.800000000000026,{"$error":"#N/A"},{"$error":"#N/A"},{"$error":"#N/A"}]
[{"$nulls":5},{"$error":"#N/A"},40.00000000000003,{"$error":"#N/A"},{"$error":"#N/A"},{"$error":"#N/A"},{"$error":"#N/A"},40.00000000000003,{"$error":"#N/A"},{"$error":"#N/A"},{"$error":"#N/A"},{"$error":"#N/A"},40.00000000000003,{"$error":"#N/A"},{"$error":"#N/A"},{"$error":"#N/A"}]
[{"$nulls":5},{"$error":"#N/A"},40.20000000000003,{"$error":"#N/A"},{"$error":"#N/A"},{"$error":"#N/A"},{"$error":"#N/A"},40.20000000000003,{"$error":"#N/A"},{"$error":"#N/A"},{"$error":"#N/A"},{"$error":"#N/A"},40.20000000000003,{"$error":"#N/A"},{"$error":"#N/A"},{"$error":"#N/A"}]
[{"$nulls":5},{"$error":"#N/A"},40.400000000000034,{"$error":"#N/A"},{"$error":"#N/A"},{"$error":"#N/A"},{"$error":"#N/A"},40.400000000000034,{"$error":"#N/A"},{"$error":"#N/A"},{"$error":"#N/A"},{"$error":"#N/A"},40.400000000000034,{"$error":"#N/A"},{"$error":"#N/A"},{"$error":"#N/A"}]
[{"$nulls":5},{"$error":"#N/A"},40.60000000000004,{"$error":"#N/A"},{"$error":"#N/A"},{"$error":"#N/A"},{"$error":"#N/A"},40.60000000000004,{"$error":"#N/A"},{"$error":"#N/A"},{"$error":"#N/A"},{"$error":"#N/A"},40.60000000000004,{"$error":"#N/A"},{"$error":"#N/A"},{"$error":"#N/A"}]
[{"$nulls":5},{"$error":"#N/A"},40.80000000000004,{"$error":"#N/A"},{"$error":"#N/A"},{"$error":"#N/A"},{"$error":"#N/A"},40.80000000000004,{"$error":"#N/A"},{"$error":"#N/A"},{"$error":"#N/A"},{"$error":"#N/A"},40.80000000000004,{"$error":"#N/A"},{"$error":"#N/A"},{"$error":"#N/A"}]
[{"$nulls":5},{"$error":"#N/A"},41.00000000000004,{"$error":"#N/A"},{"$error":"#N/A"},{"$error":"#N/A"},{"$error":"#N/A"},41.00000000000004,{"$error":"#N/A"},{"$error":"#N/A"},{"$error":"#N/A"},{"$error":"#N/A"},41.00000000000004,{"$error":"#N/A"},{"$error":"#N/A"},{"$error":"#N/A"}]
[{"$nulls":5},{"$error":"#N/A"},41.200000000000045,{"$error":"#N/A"},{"$error":"#N/A"},{"$error":"#N/A"},{"$error":"#N/A"},41.200000000000045,{"$error":"#N/A"},{"$error":"#N/A"},{"$error":"#N/A"},{"$error":"#N/A"},41.200000000000045,{"$error":"#N/A"},{"$error":"#N/A"},{"$error":"#N/A"}]
[{"$nulls":5},{"$error":"#N/A"},41.40000000000005,{"$error":"#N/A"},{"$error":"#N/A"},{"$error":"#N/A"},{"$error":"#N/A"},41.40000000000005,{"$error":"#N/A"},{"$error":"#N/A"},{"$error":"#N/A"},{"$error":"#N/A"},41.40000000000005,{"$error":"#N/A"},{"$error":"#N/A"},{"$error":"#N/A"}]
[{"$nulls":5},{"$error":"#N/A"},41.60000000000005,{"$error":"#N/A"},{"$error":"#N/A"},{"$error":"#N/A"},{"$error":"#N/A"},41.60000000000005,{"$error":"#N/A"},{"$error":"#N/A"},{"$error":"#N/A"},{"$error":"#N/A"},41.60000000000005,{"$error":"#N/A"},{"$error":"#N/A"},{"$error":"#N/A"}]
[{"$nulls":5},{"$error":"#N/A"},41.800000000000054,{"$error":"#N/A"},{"$error":"#N/A"},{"$error":"#N/A"},{"$error":"#N/A"},41.800000000000054,{"$error":"#N/A"},{"$error":"#N/A"},{"$error":"#N/A"},{"$error":"#N/A"},41.800000000000054,{"$error":"#N/A"},{"$error":"#N/A"},{"$error":"#N/A"}]
[{"$nulls":5},{"$error":"#N/A"},42.00000000000006,{"$error":"#N/A"},{"$error":"#N/A"},{"$error":"#N/A"},{"$error":"#N/A"},42.00000000000006,{"$error":"#N/A"},{"$error":"#N/A"},{"$error":"#N/A"},{"$error":"#N/A"},42.00000000000006,{"$error":"#N/A"},{"$error":"#N/A"},{"$error":"#N/A"}]
[{"$nulls":5},{"$error":"#N/A"},42.20000000000006,{"$error":"#N/A"},{"$error":"#N/A"},{"$error":"#N/A"},{"$error":"#N/A"},42.20000000000006,{"$error":"#N/A"},{"$error":"#N/A"},{"$error":"#N/A"},{"$error":"#N/A"},42.20000000000006,{"$error":"#N/A"},{"$error":"#N/A"},{"$error":"#N/A"}]
[{"$nulls":5},{"$error":"#N/A"},42.40000000000006,{"$error":"#N/A"},{"$error":"#N/A"},{"$error":"#N/A"},{"$error":"#N/A"},42.40000000000006,{"$error":"#N/A"},{"$error":"#N/A"},{"$error":"#N/A"},{"$error":"#N/A"},42.40000000000006,{"$error":"#N/A"},{"$error":"#N/A"},{"$error":"#N/A"}]
[{"$nulls":5},{"$error":"#N/A"},42.600000000000065,{"$error":"#N/A"},{"$error":"#N/A"},{"$error":"#N/A"},{"$error":"#N/A"},42.600000000000065,{"$error":"#N/A"},{"$error":"#N/A"},{"$error":"#N/A"},{"$error":"#N/A"},42.600000000000065,{"$error":"#N/A"},{"$error":"#N/A"},{"$error":"#N/A"}]
[{"$nulls":5},{"$error":"#N/A"},42.80000000000007,{"$error":"#N/A"},{"$error":"#N/A"},{"$error":"#N/A"},{"$error":"#N/A"},42.80000000000007,{"$error":"#N/A"},{"$error":"#N/A"},{"$error":"#N/A"},{"$error":"#N/A"},42.80000000000007,{"$error":"#N/A"},{"$error":"#N/A"},{"$error":"#N/A"}]
[{"$nulls":5},{"$error":"#N/A"},43.00000000000007,{"$error":"#N/A"},{"$error":"#N/A"},{"$error":"#N/A"},{"$error":"#N/A"},43.00000000000007,{"$error":"#N/A"},{"$error":"#N/A"},{"$error":"#N/A"},{"$error":"#N/A"},43.00000000000007,{"$error":"#N/A"},{"$error":"#N/A"},{"$error":"#N/A"}]
[{"$nulls":5},{"$error":"#N/A"},43.200000000000074,{"$error":"#N/A"},{"$error":"#N/A"},{"$error":"#N/A"},{"$error":"#N/A"},43.200000000000074,{"$error":"#N/A"},{"$error":"#N/A"},{"$error":"#N/A"},{"$error":"#N/A"},43.200000000000074,{"$error":"#N/A"},{"$error":"#N/A"},{"$error":"#N/A"}]
[{"$nulls":5},{"$error":"#N/A"},43.40000000000008,{"$error":"#N/A"},{"$error":"#N/A"},{"$error":"#N/A"},{"$error":"#N/A"},43.40000000000008,{"$error":"#N/A"},{"$error":"#N/A"},{"$error":"#N/A"},{"$error":"#N/A"},43.40000000000008,{"$error":"#N/A"},{"$error":"#N/A"},{"$error":"#N/A"}]
[{"$nulls":5},{"$error":"#N/A"},43.60000000000008,{"$error":"#N/A"},{"$error":"#N/A"},{"$error":"#N/A"},{"$error":"#N/A"},43.60000000000008,{"$error":"#N/A"},{"$error":"#N/A"},{"$error":"#N/A"},{"$error":"#N/A"},43.60000000000008,{"$error":"#N/A"},{"$error":"#N/A"},{"$error":"#N/A"}]
[{"$nulls":5},{"$error":"#N/A"},43.80000000000008,{"$error":"#N/A"},{"$error":"#N/A"},{"$error":"#N/A"},{"$error":"#N/A"},43.80000000000008,{"$error":"#N/A"},{"$error":"#N/A"},{"$error":"#N/A"},{"$error":"#N/A"},43.80000000000008,{"$error":"#N/A"},{"$error":"#N/A"},{"$error":"#N/A"}]
[{"$nulls":5},{"$error":"#N/A"},44.000000000000085,{"$error":"#N/A"},{"$error":"#N/A"},{"$error":"#N/A"},{"$error":"#N/A"},44.000000000000085,{"$error":"#N/A"},{"$error":"#N/A"},{"$error":"#N/A"},{"$error":"#N/A"},44.000000000000085,{"$error":"#N/A"},{"$error":"#N/A"},{"$error":"#N/A"}]
[{"$nulls":5},{"$error":"#N/A"},44.20000000000009,{"$error":"#N/A"},{"$error":"#N/A"},{"$error":"#N/A"},{"$error":"#N/A"},44.20000000000009,{"$error":"#N/A"},{"$error":"#N/A"},{"$error":"#N/A"},{"$error":"#N/A"},44.20000000000009,{"$error":"#N/A"},{"$error":"#N/A"},{"$error":"#N/A"}]
[{"$nulls":5},{"$error":"#N/A"},44.40000000000009,{"$error":"#N/A"},{"$error":"#N/A"},{"$error":"#N/A"},{"$error":"#N/A"},44.40000000000009,{"$error":"#N/A"},{"$error":"#N/A"},{"$error":"#N/A"},{"$error":"#N/A"},44.40000000000009,{"$error":"#N/A"},{"$error":"#N/A"},{"$error":"#N/A"}]
[{"$nulls":5},{"$error":"#N/A"},44.600000000000094,{"$error":"#N/A"},{"$error":"#N/A"},{"$error":"#N/A"},{"$error":"#N/A"},44.600000000000094,{"$error":"#N/A"},{"$error":"#N/A"},{"$error":"#N/A"},{"$error":"#N/A"},44.600000000000094,{"$error":"#N/A"},{"$error":"#N/A"},{"$error":"#N/A"}]
[{"$nulls":5},{"$error":"#N/A"},44.8000000000001,{"$error":"#N/A"},{"$error":"#N/A"},{"$error":"#N/A"},{"$error":"#N/A"},44.8000000000001,{"$error":"#N/A"},{"$error":"#N/A"},{"$error":"#N/A"},{"$error":"#N/A"},44.8000000000001,{"$error":"#N/A"},{"$error":"#N/A"},{"$error":"#N/A"}]
[{"$nulls":5},{"$error":"#N/A"},45.0000000000001,{"$error":"#N/A"},{"$error":"#N/A"},{"$error":"#N/A"},{"$error":"#N/A"},45.0000000000001,{"$error":"#N/A"},{"$error":"#N/A"},{"$error":"#N/A"},{"$error":"#N/A"},45.0000000000001,{"$error":"#N/A"},{"$error":"#N/A"},{"$error":"#N/A"}]
[{"$nulls":5},{"$error":"#N/A"},45.2000000000001,{"$error":"#N/A"},{"$error":"#N/A"},{"$error":"#N/A"},{"$error":"#N/A"},45.2000000000001,{"$error":"#N/A"},{"$error":"#N/A"},{"$error":"#N/A"},{"$error":"#N/A"},45.2000000000001,{"$error":"#N/A"},{"$error":"#N/A"},{"$error":"#N/A"}]
[{"$nulls":5},{"$error":"#N/A"},45.400000000000105,{"$error":"#N/A"},{"$error":"#N/A"},{"$error":"#N/A"},{"$error":"#N/A"},45.400000000000105,{"$error":"#N/A"},{"$error":"#N/A"},{"$error":"#N/A"},{"$error":"#N/A"},45.400000000000105,{"$error":"#N/A"},{"$error":"#N/A"},{"$error":"#N/A"}]
[{"$nulls":5},{"$error":"#N/A"},45.60000000000011,{"$error":"#N/A"},{"$error":"#N/A"},{"$error":"#N/A"},{"$error":"#N/A"},45.60000000000011,{"$error":"#N/A"},{"$error":"#N/A"},{"$error":"#N/A"},{"$error":"#N/A"},45.60000000000011,{"$error":"#N/A"},{"$error":"#N/A"},{"$error":"#N/A"}]
[{"$nulls":5},{"$error":"#N/A"},45.80000000000011,{"$error":"#N/A"},{"$error":"#N/A"},{"$error":"#N/A"},{"$error":"#N/A"},45.80000000000011,{"$error":"#N/A"},{"$error":"#N/A"},{"$error":"#N/A"},{"$error":"#N/A"},45.80000000000011,{"$error":"#N/A"},{"$error":"#N/A"},{"$error":"#N/A"}]
[{"$nulls":5},{"$error":"#N/A"},46.000000000000114,{"$error":"#N/A"},{"$error":"#N/A"},{"$error":"#N/A"},{"$error":"#N/A"},46.000000000000114,{"$error":"#N/A"},{"$error":"#N/A"},{"$error":"#N/A"},{"$error":"#N/A"},46.000000000000114,{"$error":"#N/A"},{"$error":"#N/A"},{"$error":"#N/A"}]
[{"$nulls":5},{"$error":"#N/A"},46.20000000000012,{"$error":"#N/A"},{"$error":"#N/A"},{"$error":"#N/A"},{"$error":"#N/A"},46.20000000000012,{"$error":"#N/A"},{"$error":"#N/A"},{"$error":"#N/A"},{"$error":"#N/A"},46.20000000000012,{"$error":"#N/A"},{"$error":"#N/A"},{"$error":"#N/A"}]
[{"$nulls":5},{"$error":"#N/A"},46.40000000000012,{"$error":"#N/A"},{"$error":"#N/A"},{"$error":"#N/A"},{"$error":"#N/A"},46.40000000000012,{"$error":"#N/A"},{"$error":"#N/A"},{"$error":"#N/A"},{"$error":"#N/A"},46.40000000000012,{"$error":"#N/A"},{"$error":"#N/A"},{"$error":"#N/A"}]
[{"$nulls":5},{"$error":"#N/A"},46.60000000000012,{"$error":"#N/A"},{"$error":"#N/A"},{"$error":"#N/A"},{"$error":"#N/A"},46.60000000000012,{"$error":"#N/A"},{"$error":"#N/A"},{"$error":"#N/A"},{"$error":"#N/A"},46.60000000000012,{"$error":"#N/A"},{"$error":"#N/A"},{"$error":"#N/A"}]
[{"$nulls":5},{"$error":"#N/A"},46.800000000000125,{"$error":"#N/A"},{"$error":"#N/A"},{"$error":"#N/A"},{"$error":"#N/A"},46.800000000000125,{"$error":"#N/A"},{"$error":"#N/A"},{"$error":"#N/A"},{"$error":"#N/A"},46.800000000000125,{"$error":"#N/A"},{"$error":"#N/A"},{"$error":"#N/A"}]
[{"$nulls":5},{"$error":"#N/A"},47.00000000000013,{"$error":"#N/A"},{"$error":"#N/A"},{"$error":"#N/A"},{"$error":"#N/A"},47.00000000000013,{"$error":"#N/A"},{"$error":"#N/A"},{"$error":"#N/A"},{"$error":"#N/A"},47.00000000000013,{"$error":"#N/A"},{"$error":"#N/A"},{"$error":"#N/A"}]
[{"$nulls":5},{"$error":"#N/A"},47.20000000000013,{"$error":"#N/A"},{"$error":"#N/A"},{"$error":"#N/A"},{"$error":"#N/A"},47.20000000000013,{"$error":"#N/A"},{"$error":"#N/A"},{"$error":"#N/A"},{"$error":"#N/A"},47.20000000000013,{"$error":"#N/A"},{"$error":"#N/A"},{"$error":"#N/A"}]
[{"$nulls":5},{"$error":"#N/A"},47.400000000000134,{"$error":"#N/A"},{"$error":"#N/A"},{"$error":"#N/A"},{"$error":"#N/A"},47.400000000000134,{"$error":"#N/A"},{"$error":"#N/A"},{"$error":"#N/A"},{"$error":"#N/A"},47.400000000000134,{"$error":"#N/A"},{"$error":"#N/A"},{"$error":"#N/A"}]
[{"$nulls":5},{"$error":"#N/A"},47.600000000000136,{"$error":"#N/A"},{"$error":"#N/A"},{"$error":"#N/A"},{"$error":"#N/A"},47.600000000000136,{"$error":"#N/A"},{"$error":"#N/A"},{"$error":"#N/A"},{"$error":"#N/A"},47.600000000000136,{"$error":"#N/A"},{"$error":"#N/A"},{"$error":"#N/A"}]
[{"$nulls":5},{"$error":"#N/A"},47.80000000000014,{"$error":"#N/A"},{"$error":"#N/A"},{"$error":"#N/A"},{"$error":"#N/A"},47.80000000000014,{"$error":"#N/A"},{"$error":"#N/A"},{"$error":"#N/A"},{"$error":"#N/A"},47.80000000000014,{"$error":"#N/A"},{"$error":"#N/A"},{"$error":"#N/A"}]
[{"$nulls":5},{"$error":"#N/A"},48.00000000000014,{"$error":"#N/A"},{"$error":"#N/A"},{"$error":"#N/A"},{"$error":"#N/A"},48.00000000000014,{"$error":"#N/A"},{"$error":"#N/A"},{"$error":"#N/A"},{"$error":"#N/A"},48.00000000000014,{"$error":"#N/A"},{"$error":"#N/A"},{"$error":"#N/A"}]
[{"$nulls":5},{"$f":"IF(F243<$I$2,F243+30,NA())","v":{"$error":"#N/A"}},{"$f":"G243+$G$2","v":48.200000000000145},{"$f":"-1+COS(F244*PI()/180)+G244","v":{"$error":"#N/A"}},{"$f":"(F244/$I$2)*($D$8-$D$7)+COS(F244*PI()/180)+$D$7-1","v":{"$error":"#N/A"}},{"$f":"$J$2*SIN(F244*PI()/180)+$B$18","v":{"$error":"#N/A"}},{"$error":"#N/A"},48.200000000000145,{"$f":"-1+COS(K244*PI()/180)+L244","v":{"$error":"#N/A"}},{"$f":"(K244/$N$2)*($D$13-$D$12)+COS(K244*PI()/180)+$D$12-1","v":{"$error":"#N/A"}},{"$f":"$O$2*SIN(K244*PI()/180)+$B$19","v":{"$error":"#N/A"}},{"$error":"#N/A"},{"$f":"Q243+$G$2","v":48.200000000000145},{"$f":"-1+COS(P244*PI()/180)+Q244","v":{"$error":"#N/A"}},{"$f":"(P244/$S$2)*($D$18-$D$17)+COS(P244*PI()/180)+$D$17-1","v":{"$error":"#N/A"}},{"$f":"$T$2*SIN(P244*PI()/180)+$B$20","v":{"$error":"#N/A"}}]
[{"$nulls":5},{"$error":"#N/A"},48.40000000000015,{"$error":"#N/A"},{"$error":"#N/A"},{"$error":"#N/A"},{"$error":"#N/A"},48.40000000000015,{"$error":"#N/A"},{"$error":"#N/A"},{"$error":"#N/A"},{"$error":"#N/A"},48.40000000000015,{"$error":"#N/A"},{"$error":"#N/A"},{"$error":"#N/A"}]
[{"$nulls":5},{"$error":"#N/A"},48.60000000000015,{"$error":"#N/A"},{"$error":"#N/A"},{"$error":"#N/A"},{"$error":"#N/A"},48.60000000000015,{"$error":"#N/A"},{"$error":"#N/A"},{"$error":"#N/A"},{"$error":"#N/A"},48.60000000000015,{"$error":"#N/A"},{"$error":"#N/A"},{"$error":"#N/A"}]
[{"$nulls":5},{"$error":"#N/A"},48.80000000000015,{"$error":"#N/A"},{"$error":"#N/A"},{"$error":"#N/A"},{"$error":"#N/A"},48.80000000000015,{"$error":"#N/A"},{"$error":"#N/A"},{"$error":"#N/A"},{"$error":"#N/A"},48.80000000000015,{"$error":"#N/A"},{"$error":"#N/A"},{"$error":"#N/A"}]
[{"$nulls":5},{"$error":"#N/A"},49.000000000000156,{"$error":"#N/A"},{"$error":"#N/A"},{"$error":"#N/A"},{"$error":"#N/A"},49.000000000000156,{"$error":"#N/A"},{"$error":"#N/A"},{"$error":"#N/A"},{"$error":"#N/A"},49.000000000000156,{"$error":"#N/A"},{"$error":"#N/A"},{"$error":"#N/A"}]
[{"$nulls":5},{"$error":"#N/A"},49.20000000000016,{"$error":"#N/A"},{"$error":"#N/A"},{"$error":"#N/A"},{"$error":"#N/A"},49.20000000000016,{"$error":"#N/A"},{"$error":"#N/A"},{"$error":"#N/A"},{"$error":"#N/A"},49.20000000000016,{"$error":"#N/A"},{"$error":"#N/A"},{"$error":"#N/A"}]
[{"$nulls":5},{"$error":"#N/A"},49.40000000000016,{"$error":"#N/A"},{"$error":"#N/A"},{"$error":"#N/A"},{"$error":"#N/A"},49.40000000000016,{"$error":"#N/A"},{"$error":"#N/A"},{"$error":"#N/A"},{"$error":"#N/A"},49.40000000000016,{"$error":"#N/A"},{"$error":"#N/A"},{"$error":"#N/A"}]
[{"$nulls":5},{"$error":"#N/A"},49.600000000000165,{"$error":"#N/A"},{"$error":"#N/A"},{"$error":"#N/A"},{"$error":"#N/A"},49.600000000000165,{"$error":"#N/A"},{"$error":"#N/A"},{"$error":"#N/A"},{"$error":"#N/A"},49.600000000000165,{"$error":"#N/A"},{"$error":"#N/A"},{"$error":"#N/A"}]
[{"$nulls":5},{"$error":"#N/A"},49.80000000000017,{"$error":"#N/A"},{"$error":"#N/A"},{"$error":"#N/A"},{"$error":"#N/A"},49.80000000000017,{"$error":"#N/A"},{"$error":"#N/A"},{"$error":"#N/A"},{"$error":"#N/A"},49.80000000000017,{"$error":"#N/A"},{"$error":"#N/A"},{"$error":"#N/A"}]
[{"$nulls":5},{"$error":"#N/A"},50.00000000000017,{"$error":"#N/A"},{"$error":"#N/A"},{"$error":"#N/A"},{"$error":"#N/A"},50.00000000000017,{"$error":"#N/A"},{"$error":"#N/A"},{"$error":"#N/A"},{"$error":"#N/A"},50.00000000000017,{"$error":"#N/A"},{"$error":"#N/A"},{"$error":"#N/A"}]
[{"$nulls":5},{"$error":"#N/A"},50.20000000000017,{"$error":"#N/A"},{"$error":"#N/A"},{"$error":"#N/A"},{"$error":"#N/A"},50.20000000000017,{"$error":"#N/A"},{"$error":"#N/A"},{"$error":"#N/A"},{"$error":"#N/A"},50.20000000000017,{"$error":"#N/A"},{"$error":"#N/A"},{"$error":"#N/A"}]
[{"$nulls":5},{"$error":"#N/A"},50.400000000000176,{"$error":"#N/A"},{"$error":"#N/A"},{"$error":"#N/A"},{"$error":"#N/A"},50.400000000000176,{"$error":"#N/A"},{"$error":"#N/A"},{"$error":"#N/A"},{"$error":"#N/A"},50.400000000000176,{"$error":"#N/A"},{"$error":"#N/A"},{"$error":"#N/A"}]
[{"$nulls":5},{"$error":"#N/A"},50.60000000000018,{"$error":"#N/A"},{"$error":"#N/A"},{"$error":"#N/A"},{"$error":"#N/A"},50.60000000000018,{"$error":"#N/A"},{"$error":"#N/A"},{"$error":"#N/A"},{"$error":"#N/A"},50.60000000000018,{"$error":"#N/A"},{"$error":"#N/A"},{"$error":"#N/A"}]
[{"$nulls":5},{"$error":"#N/A"},50.80000000000018,{"$error":"#N/A"},{"$error":"#N/A"},{"$error":"#N/A"},{"$error":"#N/A"},50.80000000000018,{"$error":"#N/A"},{"$error":"#N/A"},{"$error":"#N/A"},{"$error":"#N/A"},50.80000000000018,{"$error":"#N/A"},{"$error":"#N/A"},{"$error":"#N/A"}]
[{"$nulls":5},{"$error":"#N/A"},51.000000000000185,{"$error":"#N/A"},{"$error":"#N/A"},{"$error":"#N/A"},{"$error":"#N/A"},51.000000000000185,{"$error":"#N/A"},{"$error":"#N/A"},{"$error":"#N/A"},{"$error":"#N/A"},51.000000000000185,{"$error":"#N/A"},{"$error":"#N/A"},{"$error":"#N/A"}]
[{"$nulls":5},{"$error":"#N/A"},51.20000000000019,{"$error":"#N/A"},{"$error":"#N/A"},{"$error":"#N/A"},{"$error":"#N/A"},51.20000000000019,{"$error":"#N/A"},{"$error":"#N/A"},{"$error":"#N/A"},{"$error":"#N/A"},51.20000000000019,{"$error":"#N/A"},{"$error":"#N/A"},{"$error":"#N/A"}]
[{"$nulls":5},{"$error":"#N/A"},51.40000000000019,{"$error":"#N/A"},{"$error":"#N/A"},{"$error":"#N/A"},{"$error":"#N/A"},51.40000000000019,{"$error":"#N/A"},{"$error":"#N/A"},{"$error":"#N/A"},{"$error":"#N/A"},51.40000000000019,{"$error":"#N/A"},{"$error":"#N/A"},{"$error":"#N/A"}]
[{"$nulls":5},{"$error":"#N/A"},51.60000000000019,{"$error":"#N/A"},{"$error":"#N/A"},{"$error":"#N/A"},{"$f":"IF(K260<$N$2,K260+30,NA())","v":{"$error":"#N/A"}},{"$f":"L260+$L$2","v":51.60000000000019},{"$error":"#N/A"},{"$error":"#N/A"},{"$error":"#N/A"},{"$f":"IF(P260<$S$2,P260+30,NA())","v":{"$error":"#N/A"}},51.60000000000019,{"$error":"#N/A"},{"$error":"#N/A"},{"$error":"#N/A"}]
[{"$nulls":5},{"$error":"#N/A"},51.800000000000196,{"$error":"#N/A"},{"$error":"#N/A"},{"$error":"#N/A"},{"$error":"#N/A"},51.800000000000196,{"$error":"#N/A"},{"$error":"#N/A"},{"$error":"#N/A"},{"$error":"#N/A"},51.800000000000196,{"$error":"#N/A"},{"$error":"#N/A"},{"$error":"#N/A"}]
[{"$nulls":5},{"$error":"#N/A"},52.0000000000002,{"$error":"#N/A"},{"$error":"#N/A"},{"$error":"#N/A"},{"$error":"#N/A"},52.0000000000002,{"$error":"#N/A"},{"$error":"#N/A"},{"$error":"#N/A"},{"$error":"#N/A"},52.0000000000002,{"$error":"#N/A"},{"$error":"#N/A"},{"$error":"#N/A"}]
[{"$nulls":5},{"$error":"#N/A"},52.2000000000002,{"$error":"#N/A"},{"$error":"#N/A"},{"$error":"#N/A"},{"$error":"#N/A"},52.2000000000002,{"$error":"#N/A"},{"$error":"#N/A"},{"$error":"#N/A"},{"$error":"#N/A"},52.2000000000002,{"$error":"#N/A"},{"$error":"#N/A"},{"$error":"#N/A"}]
[{"$nulls":5},{"$error":"#N/A"},52.400000000000205,{"$error":"#N/A"},{"$error":"#N/A"},{"$error":"#N/A"},{"$error":"#N/A"},52.400000000000205,{"$error":"#N/A"},{"$error":"#N/A"},{"$error":"#N/A"},{"$error":"#N/A"},52.400000000000205,{"$error":"#N/A"},{"$error":"#N/A"},{"$error":"#N/A"}]
[{"$nulls":5},{"$error":"#N/A"},52.60000000000021,{"$error":"#N/A"},{"$error":"#N/A"},{"$error":"#N/A"},{"$error":"#N/A"},52.60000000000021,{"$error":"#N/A"},{"$error":"#N/A"},{"$error":"#N/A"},{"$error":"#N/A"},52.60000000000021,{"$error":"#N/A"},{"$error":"#N/A"},{"$error":"#N/A"}]
[{"$nulls":5},{"$error":"#N/A"},52.80000000000021,{"$error":"#N/A"},{"$error":"#N/A"},{"$error":"#N/A"},{"$error":"#N/A"},52.80000000000021,{"$error":"#N/A"},{"$error":"#N/A"},{"$error":"#N/A"},{"$error":"#N/A"},52.80000000000021,{"$error":"#N/A"},{"$error":"#N/A"},{"$error":"#N/A"}]
[{"$nulls":5},{"$error":"#N/A"},53.00000000000021,{"$error":"#N/A"},{"$error":"#N/A"},{"$error":"#N/A"},{"$error":"#N/A"},53.00000000000021,{"$error":"#N/A"},{"$error":"#N/A"},{"$error":"#N/A"},{"$error":"#N/A"},53.00000000000021,{"$error":"#N/A"},{"$error":"#N/A"},{"$error":"#N/A"}]
[{"$nulls":5},{"$error":"#N/A"},53.200000000000216,{"$error":"#N/A"},{"$error":"#N/A"},{"$error":"#N/A"},{"$error":"#N/A"},53.200000000000216,{"$error":"#N/A"},{"$error":"#N/A"},{"$error":"#N/A"},{"$error":"#N/A"},53.200000000000216,{"$error":"#N/A"},{"$error":"#N/A"},{"$error":"#N/A"}]
[{"$nulls":5},{"$error":"#N/A"},53.40000000000022,{"$error":"#N/A"},{"$error":"#N/A"},{"$error":"#N/A"},{"$error":"#N/A"},53.40000000000022,{"$error":"#N/A"},{"$error":"#N/A"},{"$error":"#N/A"},{"$error":"#N/A"},53.40000000000022,{"$error":"#N/A"},{"$error":"#N/A"},{"$error":"#N/A"}]
[{"$nulls":5},{"$error":"#N/A"},53.60000000000022,{"$error":"#N/A"},{"$error":"#N/A"},{"$error":"#N/A"},{"$error":"#N/A"},53.60000000000022,{"$error":"#N/A"},{"$error":"#N/A"},{"$error":"#N/A"},{"$error":"#N/A"},53.60000000000022,{"$error":"#N/A"},{"$error":"#N/A"},{"$error":"#N/A"}]
[{"$nulls":5},{"$error":"#N/A"},53.800000000000225,{"$error":"#N/A"},{"$error":"#N/A"},{"$error":"#N/A"},{"$error":"#N/A"},53.800000000000225,{"$error":"#N/A"},{"$error":"#N/A"},{"$error":"#N/A"},{"$error":"#N/A"},53.800000000000225,{"$error":"#N/A"},{"$error":"#N/A"},{"$error":"#N/A"}]
[{"$nulls":5},{"$error":"#N/A"},54.00000000000023,{"$error":"#N/A"},{"$error":"#N/A"},{"$error":"#N/A"},{"$error":"#N/A"},54.00000000000023,{"$error":"#N/A"},{"$error":"#N/A"},{"$error":"#N/A"},{"$error":"#N/A"},54.00000000000023,{"$error":"#N/A"},{"$error":"#N/A"},{"$error":"#N/A"}]
[{"$nulls":5},{"$error":"#N/A"},54.20000000000023,{"$error":"#N/A"},{"$error":"#N/A"},{"$error":"#N/A"},{"$error":"#N/A"},54.20000000000023,{"$error":"#N/A"},{"$error":"#N/A"},{"$error":"#N/A"},{"$error":"#N/A"},54.20000000000023,{"$error":"#N/A"},{"$error":"#N/A"},{"$error":"#N/A"}]
[{"$nulls":5},{"$error":"#N/A"},54.40000000000023,{"$error":"#N/A"},{"$error":"#N/A"},{"$error":"#N/A"},{"$error":"#N/A"},54.40000000000023,{"$error":"#N/A"},{"$error":"#N/A"},{"$error":"#N/A"},{"$error":"#N/A"},54.40000000000023,{"$error":"#N/A"},{"$error":"#N/A"},{"$error":"#N/A"}]
[{"$nulls":5},{"$error":"#N/A"},54.600000000000236,{"$error":"#N/A"},{"$error":"#N/A"},{"$error":"#N/A"},{"$error":"#N/A"},54.600000000000236,{"$error":"#N/A"},{"$error":"#N/A"},{"$error":"#N/A"},{"$error":"#N/A"},54.600000000000236,{"$error":"#N/A"},{"$error":"#N/A"},{"$error":"#N/A"}]
[{"$nulls":5},{"$error":"#N/A"},54.80000000000024,{"$error":"#N/A"},{"$error":"#N/A"},{"$error":"#N/A"},{"$error":"#N/A"},54.80000000000024,{"$error":"#N/A"},{"$error":"#N/A"},{"$error":"#N/A"},{"$error":"#N/A"},54.80000000000024,{"$error":"#N/A"},{"$error":"#N/A"},{"$error":"#N/A"}]
[{"$nulls":5},{"$error":"#N/A"},55.00000000000024,{"$error":"#N/A"},{"$error":"#N/A"},{"$error":"#N/A"},{"$error":"#N/A"},55.00000000000024,{"$error":"#N/A"},{"$error":"#N/A"},{"$error":"#N/A"},{"$error":"#N/A"},55.00000000000024,{"$error":"#N/A"},{"$error":"#N/A"},{"$error":"#N/A"}]
[{"$nulls":5},{"$error":"#N/A"},55.200000000000244,{"$error":"#N/A"},{"$error":"#N/A"},{"$error":"#N/A"},{"$error":"#N/A"},55.200000000000244,{"$error":"#N/A"},{"$error":"#N/A"},{"$error":"#N/A"},{"$error":"#N/A"},55.200000000000244,{"$error":"#N/A"},{"$error":"#N/A"},{"$error":"#N/A"}]
[{"$nulls":5},{"$error":"#N/A"},55.40000000000025,{"$error":"#N/A"},{"$error":"#N/A"},{"$error":"#N/A"},{"$error":"#N/A"},55.40000000000025,{"$error":"#N/A"},{"$error":"#N/A"},{"$error":"#N/A"},{"$error":"#N/A"},55.40000000000025,{"$error":"#N/A"},{"$error":"#N/A"},{"$error":"#N/A"}]
[{"$nulls":5},{"$error":"#N/A"},55.60000000000025,{"$error":"#N/A"},{"$error":"#N/A"},{"$error":"#N/A"},{"$error":"#N/A"},55.60000000000025,{"$error":"#N/A"},{"$error":"#N/A"},{"$error":"#N/A"},{"$error":"#N/A"},55.60000000000025,{"$error":"#N/A"},{"$error":"#N/A"},{"$error":"#N/A"}]
[{"$nulls":5},{"$error":"#N/A"},55.80000000000025,{"$error":"#N/A"},{"$error":"#N/A"},{"$error":"#N/A"},{"$error":"#N/A"},55.80000000000025,{"$error":"#N/A"},{"$error":"#N/A"},{"$error":"#N/A"},{"$error":"#N/A"},55.80000000000025,{"$error":"#N/A"},{"$error":"#N/A"},{"$error":"#N/A"}]
[{"$nulls":5},{"$error":"#N/A"},56.000000000000256,{"$error":"#N/A"},{"$error":"#N/A"},{"$error":"#N/A"},{"$error":"#N/A"},56.000000000000256,{"$error":"#N/A"},{"$error":"#N/A"},{"$error":"#N/A"},{"$error":"#N/A"},56.000000000000256,{"$error":"#N/A"},{"$error":"#N/A"},{"$error":"#N/A"}]
[{"$nulls":5},{"$error":"#N/A"},56.20000000000026,{"$error":"#N/A"},{"$error":"#N/A"},{"$error":"#N/A"},{"$error":"#N/A"},56.20000000000026,{"$error":"#N/A"},{"$error":"#N/A"},{"$error":"#N/A"},{"$error":"#N/A"},56.20000000000026,{"$error":"#N/A"},{"$error":"#N/A"},{"$error":"#N/A"}]
[{"$nulls":5},{"$error":"#N/A"},56.40000000000026,{"$error":"#N/A"},{"$error":"#N/A"},{"$error":"#N/A"},{"$error":"#N/A"},56.40000000000026,{"$error":"#N/A"},{"$error":"#N/A"},{"$error":"#N/A"},{"$error":"#N/A"},56.40000000000026,{"$error":"#N/A"},{"$error":"#N/A"},{"$error":"#N/A"}]
[{"$nulls":5},{"$error":"#N/A"},56.600000000000264,{"$error":"#N/A"},{"$error":"#N/A"},{"$error":"#N/A"},{"$error":"#N/A"},56.600000000000264,{"$error":"#N/A"},{"$error":"#N/A"},{"$error":"#N/A"},{"$error":"#N/A"},56.600000000000264,{"$error":"#N/A"},{"$error":"#N/A"},{"$error":"#N/A"}]
[{"$nulls":5},{"$error":"#N/A"},56.80000000000027,{"$error":"#N/A"},{"$error":"#N/A"},{"$error":"#N/A"},{"$error":"#N/A"},56.80000000000027,{"$error":"#N/A"},{"$error":"#N/A"},{"$error":"#N/A"},{"$error":"#N/A"},56.80000000000027,{"$error":"#N/A"},{"$error":"#N/A"},{"$error":"#N/A"}]
[{"$nulls":5},{"$error":"#N/A"},57.00000000000027,{"$error":"#N/A"},{"$error":"#N/A"},{"$error":"#N/A"},{"$error":"#N/A"},57.00000000000027,{"$error":"#N/A"},{"$error":"#N/A"},{"$error":"#N/A"},{"$error":"#N/A"},57.00000000000027,{"$error":"#N/A"},{"$error":"#N/A"},{"$error":"#N/A"}]
[{"$nulls":5},{"$error":"#N/A"},57.20000000000027,{"$error":"#N/A"},{"$error":"#N/A"},{"$error":"#N/A"},{"$error":"#N/A"},57.20000000000027,{"$error":"#N/A"},{"$error":"#N/A"},{"$error":"#N/A"},{"$error":"#N/A"},57.20000000000027,{"$error":"#N/A"},{"$error":"#N/A"},{"$error":"#N/A"}]
[{"$nulls":5},{"$error":"#N/A"},57.400000000000276,{"$error":"#N/A"},{"$error":"#N/A"},{"$error":"#N/A"},{"$error":"#N/A"},57.400000000000276,{"$error":"#N/A"},{"$error":"#N/A"},{"$error":"#N/A"},{"$error":"#N/A"},57.400000000000276,{"$error":"#N/A"},{"$error":"#N/A"},{"$error":"#N/A"}]
[{"$nulls":5},{"$error":"#N/A"},57.60000000000028,{"$error":"#N/A"},{"$error":"#N/A"},{"$error":"#N/A"},{"$error":"#N/A"},57.60000000000028,{"$error":"#N/A"},{"$error":"#N/A"},{"$error":"#N/A"},{"$error":"#N/A"},57.60000000000028,{"$error":"#N/A"},{"$error":"#N/A"},{"$error":"#N/A"}]
[{"$nulls":5},{"$error":"#N/A"},57.80000000000028,{"$error":"#N/A"},{"$error":"#N/A"},{"$error":"#N/A"},{"$error":"#N/A"},57.80000000000028,{"$error":"#N/A"},{"$error":"#N/A"},{"$error":"#N/A"},{"$error":"#N/A"},57.80000000000028,{"$error":"#N/A"},{"$error":"#N/A"},{"$error":"#N/A"}]
[{"$nulls":5},{"$error":"#N/A"},58.000000000000284,{"$error":"#N/A"},{"$error":"#N/A"},{"$error":"#N/A"},{"$error":"#N/A"},58.000000000000284,{"$error":"#N/A"},{"$error":"#N/A"},{"$error":"#N/A"},{"$error":"#N/A"},58.000000000000284,{"$error":"#N/A"},{"$error":"#N/A"},{"$error":"#N/A"}]
[{"$nulls":5},{"$error":"#N/A"},58.20000000000029,{"$error":"#N/A"},{"$error":"#N/A"},{"$error":"#N/A"},{"$error":"#N/A"},58.20000000000029,{"$error":"#N/A"},{"$error":"#N/A"},{"$error":"#N/A"},{"$error":"#N/A"},58.20000000000029,{"$error":"#N/A"},{"$error":"#N/A"},{"$error":"#N/A"}]
[{"$nulls":5},{"$error":"#N/A"},58.40000000000029,{"$error":"#N/A"},{"$error":"#N/A"},{"$error":"#N/A"},{"$error":"#N/A"},58.40000000000029,{"$error":"#N/A"},{"$error":"#N/A"},{"$error":"#N/A"},{"$error":"#N/A"},58.40000000000029,{"$error":"#N/A"},{"$error":"#N/A"},{"$error":"#N/A"}]
[{"$nulls":5},{"$error":"#N/A"},58.60000000000029,{"$error":"#N/A"},{"$error":"#N/A"},{"$error":"#N/A"},{"$error":"#N/A"},58.60000000000029,{"$error":"#N/A"},{"$error":"#N/A"},{"$error":"#N/A"},{"$error":"#N/A"},58.60000000000029,{"$error":"#N/A"},{"$error":"#N/A"},{"$error":"#N/A"}]
[{"$nulls":5},{"$error":"#N/A"},58.800000000000296,{"$error":"#N/A"},{"$error":"#N/A"},{"$error":"#N/A"},{"$error":"#N/A"},58.800000000000296,{"$error":"#N/A"},{"$error":"#N/A"},{"$error":"#N/A"},{"$error":"#N/A"},58.800000000000296,{"$error":"#N/A"},{"$error":"#N/A"},{"$error":"#N/A"}]
[{"$nulls":5},{"$error":"#N/A"},59.0000000000003,{"$error":"#N/A"},{"$error":"#N/A"},{"$error":"#N/A"},{"$error":"#N/A"},59.0000000000003,{"$error":"#N/A"},{"$error":"#N/A"},{"$error":"#N/A"},{"$error":"#N/A"},59.0000000000003,{"$error":"#N/A"},{"$error":"#N/A"},{"$error":"#N/A"}]
[{"$nulls":5},{"$error":"#N/A"},59.2000000000003,{"$error":"#N/A"},{"$error":"#N/A"},{"$error":"#N/A"},{"$error":"#N/A"},59.2000000000003,{"$error":"#N/A"},{"$error":"#N/A"},{"$error":"#N/A"},{"$error":"#N/A"},59.2000000000003,{"$error":"#N/A"},{"$error":"#N/A"},{"$error":"#N/A"}]
[{"$nulls":5},{"$error":"#N/A"},59.400000000000304,{"$error":"#N/A"},{"$error":"#N/A"},{"$error":"#N/A"},{"$error":"#N/A"},59.400000000000304,{"$error":"#N/A"},{"$error":"#N/A"},{"$error":"#N/A"},{"$error":"#N/A"},59.400000000000304,{"$error":"#N/A"},{"$error":"#N/A"},{"$error":"#N/A"}]
[{"$nulls":5},{"$error":"#N/A"},59.60000000000031,{"$error":"#N/A"},{"$error":"#N/A"},{"$error":"#N/A"},{"$error":"#N/A"},59.60000000000031,{"$error":"#N/A"},{"$error":"#N/A"},{"$error":"#N/A"},{"$error":"#N/A"},59.60000000000031,{"$error":"#N/A"},{"$error":"#N/A"},{"$error":"#N/A"}]
[{"$nulls":5},{"$error":"#N/A"},59.80000000000031,{"$error":"#N/A"},{"$error":"#N/A"},{"$error":"#N/A"},{"$error":"#N/A"},59.80000000000031,{"$error":"#N/A"},{"$error":"#N/A"},{"$error":"#N/A"},{"$error":"#N/A"},59.80000000000031,{"$error":"#N/A"},{"$error":"#N/A"},{"$error":"#N/A"}]
[{"$nulls":5},{"$error":"#N/A"},60.00000000000031,{"$error":"#N/A"},{"$error":"#N/A"},{"$error":"#N/A"},{"$error":"#N/A"},60.00000000000031,{"$error":"#N/A"},{"$error":"#N/A"},{"$error":"#N/A"},{"$error":"#N/A"},60.00000000000031,{"$error":"#N/A"},{"$error":"#N/A"},{"$error":"#N/A"}]
[{"$nulls":5},{"$error":"#N/A"},60.200000000000315,{"$error":"#N/A"},{"$error":"#N/A"},{"$error":"#N/A"},{"$error":"#N/A"},60.200000000000315,{"$error":"#N/A"},{"$error":"#N/A"},{"$error":"#N/A"},{"$error":"#N/A"},60.200000000000315,{"$error":"#N/A"},{"$error":"#N/A"},{"$error":"#N/A"}]
[{"$nulls":5},{"$error":"#N/A"},60.40000000000032,{"$error":"#N/A"},{"$error":"#N/A"},{"$error":"#N/A"},{"$error":"#N/A"},60.40000000000032,{"$error":"#N/A"},{"$error":"#N/A"},{"$error":"#N/A"},{"$error":"#N/A"},60.40000000000032,{"$error":"#N/A"},{"$error":"#N/A"},{"$error":"#N/A"}]
[{"$nulls":5},{"$error":"#N/A"},60.60000000000032,{"$error":"#N/A"},{"$error":"#N/A"},{"$error":"#N/A"},{"$error":"#N/A"},60.60000000000032,{"$error":"#N/A"},{"$error":"#N/A"},{"$error":"#N/A"},{"$error":"#N/A"},60.60000000000032,{"$error":"#N/A"},{"$error":"#N/A"},{"$error":"#N/A"}]
[{"$nulls":5},{"$error":"#N/A"},60.800000000000324,{"$error":"#N/A"},{"$error":"#N/A"},{"$error":"#N/A"},{"$error":"#N/A"},60.800000000000324,{"$error":"#N/A"},{"$error":"#N/A"},{"$error":"#N/A"},{"$error":"#N/A"},60.800000000000324,{"$error":"#N/A"},{"$error":"#N/A"},{"$error":"#N/A"}]
[{"$nulls":5},{"$f":"IF(F307<$I$2,F307+30,NA())","v":{"$error":"#N/A"}},{"$f":"G307+$G$2","v":61.00000000000033},{"$f":"-1+COS(F308*PI()/180)+G308","v":{"$error":"#N/A"}},{"$f":"(F308/$I$2)*($D$8-$D$7)+COS(F308*PI()/180)+$D$7-1","v":{"$error":"#N/A"}},{"$f":"$J$2*SIN(F308*PI()/180)+$B$18","v":{"$error":"#N/A"}},{"$error":"#N/A"},61.00000000000033,{"$f":"-1+COS(K308*PI()/180)+L308","v":{"$error":"#N/A"}},{"$f":"(K308/$N$2)*($D$13-$D$12)+COS(K308*PI()/180)+$D$12-1","v":{"$error":"#N/A"}},{"$f":"$O$2*SIN(K308*PI()/180)+$B$19","v":{"$error":"#N/A"}},{"$error":"#N/A"},{"$f":"Q307+$G$2","v":61.00000000000033},{"$f":"-1+COS(P308*PI()/180)+Q308","v":{"$error":"#N/A"}},{"$f":"(P308/$S$2)*($D$18-$D$17)+COS(P308*PI()/180)+$D$17-1","v":{"$error":"#N/A"}},{"$f":"$T$2*SIN(P308*PI()/180)+$B$20","v":{"$error":"#N/A"}}]
[{"$nulls":5},{"$error":"#N/A"},61.20000000000033,{"$error":"#N/A"},{"$error":"#N/A"},{"$error":"#N/A"},{"$error":"#N/A"},61.20000000000033,{"$error":"#N/A"},{"$error":"#N/A"},{"$error":"#N/A"},{"$error":"#N/A"},61.20000000000033,{"$error":"#N/A"},{"$error":"#N/A"},{"$error":"#N/A"}]
[{"$nulls":5},{"$error":"#N/A"},61.40000000000033,{"$error":"#N/A"},{"$error":"#N/A"},{"$error":"#N/A"},{"$error":"#N/A"},61.40000000000033,{"$error":"#N/A"},{"$error":"#N/A"},{"$error":"#N/A"},{"$error":"#N/A"},61.40000000000033,{"$error":"#N/A"},{"$error":"#N/A"},{"$error":"#N/A"}]
[{"$nulls":5},{"$error":"#N/A"},61.600000000000335,{"$error":"#N/A"},{"$error":"#N/A"},{"$error":"#N/A"},{"$error":"#N/A"},61.600000000000335,{"$error":"#N/A"},{"$error":"#N/A"},{"$error":"#N/A"},{"$error":"#N/A"},61.600000000000335,{"$error":"#N/A"},{"$error":"#N/A"},{"$error":"#N/A"}]
[{"$nulls":5},{"$error":"#N/A"},61.80000000000034,{"$error":"#N/A"},{"$error":"#N/A"},{"$error":"#N/A"},{"$error":"#N/A"},61.80000000000034,{"$error":"#N/A"},{"$error":"#N/A"},{"$error":"#N/A"},{"$error":"#N/A"},61.80000000000034,{"$error":"#N/A"},{"$error":"#N/A"},{"$error":"#N/A"}]
[{"$nulls":5},{"$error":"#N/A"},62.00000000000034,{"$error":"#N/A"},{"$error":"#N/A"},{"$error":"#N/A"},{"$error":"#N/A"},62.00000000000034,{"$error":"#N/A"},{"$error":"#N/A"},{"$error":"#N/A"},{"$error":"#N/A"},62.00000000000034,{"$error":"#N/A"},{"$error":"#N/A"},{"$error":"#N/A"}]
[{"$nulls":5},{"$error":"#N/A"},62.200000000000344,{"$error":"#N/A"},{"$error":"#N/A"},{"$error":"#N/A"},{"$error":"#N/A"},62.200000000000344,{"$error":"#N/A"},{"$error":"#N/A"},{"$error":"#N/A"},{"$error":"#N/A"},62.200000000000344,{"$error":"#N/A"},{"$error":"#N/A"},{"$error":"#N/A"}]
[{"$nulls":5},{"$error":"#N/A"},62.40000000000035,{"$error":"#N/A"},{"$error":"#N/A"},{"$error":"#N/A"},{"$error":"#N/A"},62.40000000000035,{"$error":"#N/A"},{"$error":"#N/A"},{"$error":"#N/A"},{"$error":"#N/A"},62.40000000000035,{"$error":"#N/A"},{"$error":"#N/A"},{"$error":"#N/A"}]
[{"$nulls":5},{"$error":"#N/A"},62.60000000000035,{"$error":"#N/A"},{"$error":"#N/A"},{"$error":"#N/A"},{"$error":"#N/A"},62.60000000000035,{"$error":"#N/A"},{"$error":"#N/A"},{"$error":"#N/A"},{"$error":"#N/A"},62.60000000000035,{"$error":"#N/A"},{"$error":"#N/A"},{"$error":"#N/A"}]
[{"$nulls":5},{"$error":"#N/A"},62.80000000000035,{"$error":"#N/A"},{"$error":"#N/A"},{"$error":"#N/A"},{"$error":"#N/A"},62.80000000000035,{"$error":"#N/A"},{"$error":"#N/A"},{"$error":"#N/A"},{"$error":"#N/A"},62.80000000000035,{"$error":"#N/A"},{"$error":"#N/A"},{"$error":"#N/A"}]
[{"$nulls":5},{"$error":"#N/A"},63.000000000000355,{"$error":"#N/A"},{"$error":"#N/A"},{"$error":"#N/A"},{"$error":"#N/A"},63.000000000000355,{"$error":"#N/A"},{"$error":"#N/A"},{"$error":"#N/A"},{"$error":"#N/A"},63.000000000000355,{"$error":"#N/A"},{"$error":"#N/A"},{"$error":"#N/A"}]
[{"$nulls":5},{"$error":"#N/A"},63.20000000000036,{"$error":"#N/A"},{"$error":"#N/A"},{"$error":"#N/A"},{"$error":"#N/A"},63.20000000000036,{"$error":"#N/A"},{"$error":"#N/A"},{"$error":"#N/A"},{"$error":"#N/A"},63.20000000000036,{"$error":"#N/A"},{"$error":"#N/A"},{"$error":"#N/A"}]
[{"$nulls":5},{"$error":"#N/A"},63.40000000000036,{"$error":"#N/A"},{"$error":"#N/A"},{"$error":"#N/A"},{"$error":"#N/A"},63.40000000000036,{"$error":"#N/A"},{"$error":"#N/A"},{"$error":"#N/A"},{"$error":"#N/A"},63.40000000000036,{"$error":"#N/A"},{"$error":"#N/A"},{"$error":"#N/A"}]
[{"$nulls":5},{"$error":"#N/A"},63.600000000000364,{"$error":"#N/A"},{"$error":"#N/A"},{"$error":"#N/A"},{"$error":"#N/A"},63.600000000000364,{"$error":"#N/A"},{"$error":"#N/A"},{"$error":"#N/A"},{"$error":"#N/A"},63.600000000000364,{"$error":"#N/A"},{"$error":"#N/A"},{"$error":"#N/A"}]
[{"$nulls":5},{"$error":"#N/A"},63.80000000000037,{"$error":"#N/A"},{"$error":"#N/A"},{"$error":"#N/A"},{"$error":"#N/A"},63.80000000000037,{"$error":"#N/A"},{"$error":"#N/A"},{"$error":"#N/A"},{"$error":"#N/A"},63.80000000000037,{"$error":"#N/A"},{"$error":"#N/A"},{"$error":"#N/A"}]
[{"$nulls":5},{"$error":"#N/A"},64.00000000000037,{"$error":"#N/A"},{"$error":"#N/A"},{"$error":"#N/A"},{"$error":"#N/A"},64.00000000000037,{"$error":"#N/A"},{"$error":"#N/A"},{"$error":"#N/A"},{"$error":"#N/A"},64.00000000000037,{"$error":"#N/A"},{"$error":"#N/A"},{"$error":"#N/A"}]
[{"$nulls":5},{"$error":"#N/A"},64.20000000000037,{"$error":"#N/A"},{"$error":"#N/A"},{"$error":"#N/A"},{"$error":"#N/A"},64.20000000000037,{"$error":"#N/A"},{"$error":"#N/A"},{"$error":"#N/A"},{"$error":"#N/A"},64.20000000000037,{"$error":"#N/A"},{"$error":"#N/A"},{"$error":"#N/A"}]
[{"$nulls":5},{"$error":"#N/A"},64.40000000000038,{"$error":"#N/A"},{"$error":"#N/A"},{"$error":"#N/A"},{"$f":"IF(K324<$N$2,K324+30,NA())","v":{"$error":"#N/A"}},{"$f":"L324+$L$2","v":64.40000000000038},{"$error":"#N/A"},{"$error":"#N/A"},{"$error":"#N/A"},{"$f":"IF(P324<$S$2,P324+30,NA())","v":{"$error":"#N/A"}},64.40000000000038,{"$error":"#N/A"},{"$error":"#N/A"},{"$error":"#N/A"}]
[{"$nulls":5},{"$error":"#N/A"},64.60000000000038,{"$error":"#N/A"},{"$error":"#N/A"},{"$error":"#N/A"},{"$error":"#N/A"},64.60000000000038,{"$error":"#N/A"},{"$error":"#N/A"},{"$error":"#N/A"},{"$error":"#N/A"},64.60000000000038,{"$error":"#N/A"},{"$error":"#N/A"},{"$error":"#N/A"}]
[{"$nulls":5},{"$error":"#N/A"},64.80000000000038,{"$error":"#N/A"},{"$error":"#N/A"},{"$error":"#N/A"},{"$error":"#N/A"},64.80000000000038,{"$error":"#N/A"},{"$error":"#N/A"},{"$error":"#N/A"},{"$error":"#N/A"},64.80000000000038,{"$error":"#N/A"},{"$error":"#N/A"},{"$error":"#N/A"}]
[{"$nulls":5},{"$error":"#N/A"},65.00000000000038,{"$error":"#N/A"},{"$error":"#N/A"},{"$error":"#N/A"},{"$error":"#N/A"},65.00000000000038,{"$error":"#N/A"},{"$error":"#N/A"},{"$error":"#N/A"},{"$error":"#N/A"},65.00000000000038,{"$error":"#N/A"},{"$error":"#N/A"},{"$error":"#N/A"}]
[{"$nulls":5},{"$error":"#N/A"},65.20000000000039,{"$error":"#N/A"},{"$error":"#N/A"},{"$error":"#N/A"},{"$error":"#N/A"},65.20000000000039,{"$error":"#N/A"},{"$error":"#N/A"},{"$error":"#N/A"},{"$error":"#N/A"},65.20000000000039,{"$error":"#N/A"},{"$error":"#N/A"},{"$error":"#N/A"}]
[{"$nulls":5},{"$error":"#N/A"},65.40000000000039,{"$error":"#N/A"},{"$error":"#N/A"},{"$error":"#N/A"},{"$error":"#N/A"},65.40000000000039,{"$error":"#N/A"},{"$error":"#N/A"},{"$error":"#N/A"},{"$error":"#N/A"},65.40000000000039,{"$error":"#N/A"},{"$error":"#N/A"},{"$error":"#N/A"}]
[{"$nulls":5},{"$error":"#N/A"},65.60000000000039,{"$error":"#N/A"},{"$error":"#N/A"},{"$error":"#N/A"},{"$error":"#N/A"},65.60000000000039,{"$error":"#N/A"},{"$error":"#N/A"},{"$error":"#N/A"},{"$error":"#N/A"},65.60000000000039,{"$error":"#N/A"},{"$error":"#N/A"},{"$error":"#N/A"}]
[{"$nulls":5},{"$error":"#N/A"},65.8000000000004,{"$error":"#N/A"},{"$error":"#N/A"},{"$error":"#N/A"},{"$error":"#N/A"},65.8000000000004,{"$error":"#N/A"},{"$error":"#N/A"},{"$error":"#N/A"},{"$error":"#N/A"},65.8000000000004,{"$error":"#N/A"},{"$error":"#N/A"},{"$error":"#N/A"}]
[{"$nulls":5},{"$error":"#N/A"},66.0000000000004,{"$error":"#N/A"},{"$error":"#N/A"},{"$error":"#N/A"},{"$error":"#N/A"},66.0000000000004,{"$error":"#N/A"},{"$error":"#N/A"},{"$error":"#N/A"},{"$error":"#N/A"},66.0000000000004,{"$error":"#N/A"},{"$error":"#N/A"},{"$error":"#N/A"}]
[{"$nulls":5},{"$error":"#N/A"},66.2000000000004,{"$error":"#N/A"},{"$error":"#N/A"},{"$error":"#N/A"},{"$error":"#N/A"},66.2000000000004,{"$error":"#N/A"},{"$error":"#N/A"},{"$error":"#N/A"},{"$error":"#N/A"},66.2000000000004,{"$error":"#N/A"},{"$error":"#N/A"},{"$error":"#N/A"}]
[{"$nulls":5},{"$error":"#N/A"},66.4000000000004,{"$error":"#N/A"},{"$error":"#N/A"},{"$error":"#N/A"},{"$error":"#N/A"},66.4000000000004,{"$error":"#N/A"},{"$error":"#N/A"},{"$error":"#N/A"},{"$error":"#N/A"},66.4000000000004,{"$error":"#N/A"},{"$error":"#N/A"},{"$error":"#N/A"}]
[{"$nulls":5},{"$error":"#N/A"},66.6000000000004,{"$error":"#N/A"},{"$error":"#N/A"},{"$error":"#N/A"},{"$error":"#N/A"},66.6000000000004,{"$error":"#N/A"},{"$error":"#N/A"},{"$error":"#N/A"},{"$error":"#N/A"},66.6000000000004,{"$error":"#N/A"},{"$error":"#N/A"},{"$error":"#N/A"}]
[{"$nulls":5},{"$error":"#N/A"},66.80000000000041,{"$error":"#N/A"},{"$error":"#N/A"},{"$error":"#N/A"},{"$error":"#N/A"},66.80000000000041,{"$error":"#N/A"},{"$error":"#N/A"},{"$error":"#N/A"},{"$error":"#N/A"},66.80000000000041,{"$error":"#N/A"},{"$error":"#N/A"},{"$error":"#N/A"}]
[{"$nulls":5},{"$error":"#N/A"},67.00000000000041,{"$error":"#N/A"},{"$error":"#N/A"},{"$error":"#N/A"},{"$error":"#N/A"},67.00000000000041,{"$error":"#N/A"},{"$error":"#N/A"},{"$error":"#N/A"},{"$error":"#N/A"},67.00000000000041,{"$error":"#N/A"},{"$error":"#N/A"},{"$error":"#N/A"}]
[{"$nulls":5},{"$error":"#N/A"},67.20000000000041,{"$error":"#N/A"},{"$error":"#N/A"},{"$error":"#N/A"},{"$error":"#N/A"},67.20000000000041,{"$error":"#N/A"},{"$error":"#N/A"},{"$error":"#N/A"},{"$error":"#N/A"},67.20000000000041,{"$error":"#N/A"},{"$error":"#N/A"},{"$error":"#N/A"}]
[{"$nulls":5},{"$error":"#N/A"},67.40000000000042,{"$error":"#N/A"},{"$error":"#N/A"},{"$error":"#N/A"},{"$error":"#N/A"},67.40000000000042,{"$error":"#N/A"},{"$error":"#N/A"},{"$error":"#N/A"},{"$error":"#N/A"},67.40000000000042,{"$error":"#N/A"},{"$error":"#N/A"},{"$error":"#N/A"}]
[{"$nulls":5},{"$error":"#N/A"},67.60000000000042,{"$error":"#N/A"},{"$error":"#N/A"},{"$error":"#N/A"},{"$error":"#N/A"},67.60000000000042,{"$error":"#N/A"},{"$error":"#N/A"},{"$error":"#N/A"},{"$error":"#N/A"},67.60000000000042,{"$error":"#N/A"},{"$error":"#N/A"},{"$error":"#N/A"}]
[{"$nulls":5},{"$error":"#N/A"},67.80000000000042,{"$error":"#N/A"},{"$error":"#N/A"},{"$error":"#N/A"},{"$error":"#N/A"},67.80000000000042,{"$error":"#N/A"},{"$error":"#N/A"},{"$error":"#N/A"},{"$error":"#N/A"},67.80000000000042,{"$error":"#N/A"},{"$error":"#N/A"},{"$error":"#N/A"}]
[{"$nulls":5},{"$error":"#N/A"},68.00000000000043,{"$error":"#N/A"},{"$error":"#N/A"},{"$error":"#N/A"},{"$error":"#N/A"},68.00000000000043,{"$error":"#N/A"},{"$error":"#N/A"},{"$error":"#N/A"},{"$error":"#N/A"},68.00000000000043,{"$error":"#N/A"},{"$error":"#N/A"},{"$error":"#N/A"}]
[{"$nulls":5},{"$error":"#N/A"},68.20000000000043,{"$error":"#N/A"},{"$error":"#N/A"},{"$error":"#N/A"},{"$error":"#N/A"},68.20000000000043,{"$error":"#N/A"},{"$error":"#N/A"},{"$error":"#N/A"},{"$error":"#N/A"},68.20000000000043,{"$error":"#N/A"},{"$error":"#N/A"},{"$error":"#N/A"}]
[{"$nulls":5},{"$error":"#N/A"},68.40000000000043,{"$error":"#N/A"},{"$error":"#N/A"},{"$error":"#N/A"},{"$error":"#N/A"},68.40000000000043,{"$error":"#N/A"},{"$error":"#N/A"},{"$error":"#N/A"},{"$error":"#N/A"},68.40000000000043,{"$error":"#N/A"},{"$error":"#N/A"},{"$error":"#N/A"}]
[{"$nulls":5},{"$error":"#N/A"},68.60000000000043,{"$error":"#N/A"},{"$error":"#N/A"},{"$error":"#N/A"},{"$error":"#N/A"},68.60000000000043,{"$error":"#N/A"},{"$error":"#N/A"},{"$error":"#N/A"},{"$error":"#N/A"},68.60000000000043,{"$error":"#N/A"},{"$error":"#N/A"},{"$error":"#N/A"}]
[{"$nulls":5},{"$error":"#N/A"},68.80000000000044,{"$error":"#N/A"},{"$error":"#N/A"},{"$error":"#N/A"},{"$error":"#N/A"},68.80000000000044,{"$error":"#N/A"},{"$error":"#N/A"},{"$error":"#N/A"},{"$error":"#N/A"},68.80000000000044,{"$error":"#N/A"},{"$error":"#N/A"},{"$error":"#N/A"}]
[{"$nulls":5},{"$error":"#N/A"},69.00000000000044,{"$error":"#N/A"},{"$error":"#N/A"},{"$error":"#N/A"},{"$error":"#N/A"},69.00000000000044,{"$error":"#N/A"},{"$error":"#N/A"},{"$error":"#N/A"},{"$error":"#N/A"},69.00000000000044,{"$error":"#N/A"},{"$error":"#N/A"},{"$error":"#N/A"}]
[{"$nulls":5},{"$error":"#N/A"},69.20000000000044,{"$error":"#N/A"},{"$error":"#N/A"},{"$error":"#N/A"},{"$error":"#N/A"},69.20000000000044,{"$error":"#N/A"},{"$error":"#N/A"},{"$error":"#N/A"},{"$error":"#N/A"},69.20000000000044,{"$error":"#N/A"},{"$error":"#N/A"},{"$error":"#N/A"}]
[{"$nulls":5},{"$error":"#N/A"},69.40000000000045,{"$error":"#N/A"},{"$error":"#N/A"},{"$error":"#N/A"},{"$error":"#N/A"},69.40000000000045,{"$error":"#N/A"},{"$error":"#N/A"},{"$error":"#N/A"},{"$error":"#N/A"},69.40000000000045,{"$error":"#N/A"},{"$error":"#N/A"},{"$error":"#N/A"}]
[{"$nulls":5},{"$error":"#N/A"},69.60000000000045,{"$error":"#N/A"},{"$error":"#N/A"},{"$error":"#N/A"},{"$error":"#N/A"},69.60000000000045,{"$error":"#N/A"},{"$error":"#N/A"},{"$error":"#N/A"},{"$error":"#N/A"},69.60000000000045,{"$error":"#N/A"},{"$error":"#N/A"},{"$error":"#N/A"}]
[{"$nulls":5},{"$error":"#N/A"},69.80000000000045,{"$error":"#N/A"},{"$error":"#N/A"},{"$error":"#N/A"},{"$error":"#N/A"},69.80000000000045,{"$error":"#N/A"},{"$error":"#N/A"},{"$error":"#N/A"},{"$error":"#N/A"},69.80000000000045,{"$error":"#N/A"},{"$error":"#N/A"},{"$error":"#N/A"}]
[{"$nulls":5},{"$error":"#N/A"},70.00000000000045,{"$error":"#N/A"},{"$error":"#N/A"},{"$error":"#N/A"},{"$error":"#N/A"},70.00000000000045,{"$error":"#N/A"},{"$error":"#N/A"},{"$error":"#N/A"},{"$error":"#N/A"},70.00000000000045,{"$error":"#N/A"},{"$error":"#N/A"},{"$error":"#N/A"}]
[{"$nulls":5},{"$error":"#N/A"},70.20000000000046,{"$error":"#N/A"},{"$error":"#N/A"},{"$error":"#N/A"},{"$error":"#N/A"},70.20000000000046,{"$error":"#N/A"},{"$error":"#N/A"},{"$error":"#N/A"},{"$error":"#N/A"},70.20000000000046,{"$error":"#N/A"},{"$error":"#N/A"},{"$error":"#N/A"}]
[{"$nulls":5},{"$error":"#N/A"},70.40000000000046,{"$error":"#N/A"},{"$error":"#N/A"},{"$error":"#N/A"},{"$error":"#N/A"},70.40000000000046,{"$error":"#N/A"},{"$error":"#N/A"},{"$error":"#N/A"},{"$error":"#N/A"},70.40000000000046,{"$error":"#N/A"},{"$error":"#N/A"},{"$error":"#N/A"}]
[{"$nulls":5},{"$error":"#N/A"},70.60000000000046,{"$error":"#N/A"},{"$error":"#N/A"},{"$error":"#N/A"},{"$error":"#N/A"},70.60000000000046,{"$error":"#N/A"},{"$error":"#N/A"},{"$error":"#N/A"},{"$error":"#N/A"},70.60000000000046,{"$error":"#N/A"},{"$error":"#N/A"},{"$error":"#N/A"}]
[{"$nulls":5},{"$error":"#N/A"},70.80000000000047,{"$error":"#N/A"},{"$error":"#N/A"},{"$error":"#N/A"},{"$error":"#N/A"},70.80000000000047,{"$error":"#N/A"},{"$error":"#N/A"},{"$error":"#N/A"},{"$error":"#N/A"},70.80000000000047,{"$error":"#N/A"},{"$error":"#N/A"},{"$error":"#N/A"}]
[{"$nulls":5},{"$error":"#N/A"},71.00000000000047,{"$error":"#N/A"},{"$error":"#N/A"},{"$error":"#N/A"},{"$error":"#N/A"},71.00000000000047,{"$error":"#N/A"},{"$error":"#N/A"},{"$error":"#N/A"},{"$error":"#N/A"},71.00000000000047,{"$error":"#N/A"},{"$error":"#N/A"},{"$error":"#N/A"}]
[{"$nulls":5},{"$error":"#N/A"},71.20000000000047,{"$error":"#N/A"},{"$error":"#N/A"},{"$error":"#N/A"},{"$error":"#N/A"},71.20000000000047,{"$error":"#N/A"},{"$error":"#N/A"},{"$error":"#N/A"},{"$error":"#N/A"},71.20000000000047,{"$error":"#N/A"},{"$error":"#N/A"},{"$error":"#N/A"}]
[{"$nulls":5},{"$error":"#N/A"},71.40000000000047,{"$error":"#N/A"},{"$error":"#N/A"},{"$error":"#N/A"},{"$error":"#N/A"},71.40000000000047,{"$error":"#N/A"},{"$error":"#N/A"},{"$error":"#N/A"},{"$error":"#N/A"},71.40000000000047,{"$error":"#N/A"},{"$error":"#N/A"},{"$error":"#N/A"}]
[{"$nulls":5},{"$error":"#N/A"},71.60000000000048,{"$error":"#N/A"},{"$error":"#N/A"},{"$error":"#N/A"},{"$error":"#N/A"},71.60000000000048,{"$error":"#N/A"},{"$error":"#N/A"},{"$error":"#N/A"},{"$error":"#N/A"},71.60000000000048,{"$error":"#N/A"},{"$error":"#N/A"},{"$error":"#N/A"}]
[{"$nulls":5},{"$error":"#N/A"},71.80000000000048,{"$error":"#N/A"},{"$error":"#N/A"},{"$error":"#N/A"},{"$error":"#N/A"},71.80000000000048,{"$error":"#N/A"},{"$error":"#N/A"},{"$error":"#N/A"},{"$error":"#N/A"},71.80000000000048,{"$error":"#N/A"},{"$error":"#N/A"},{"$error":"#N/A"}]
[{"$nulls":5},{"$error":"#N/A"},72.00000000000048,{"$error":"#N/A"},{"$error":"#N/A"},{"$error":"#N/A"},{"$error":"#N/A"},72.00000000000048,{"$error":"#N/A"},{"$error":"#N/A"},{"$error":"#N/A"},{"$error":"#N/A"},72.00000000000048,{"$error":"#N/A"},{"$error":"#N/A"},{"$error":"#N/A"}]
[{"$nulls":5},{"$error":"#N/A"},72.20000000000049,{"$error":"#N/A"},{"$error":"#N/A"},{"$error":"#N/A"},{"$error":"#N/A"},72.20000000000049,{"$error":"#N/A"},{"$error":"#N/A"},{"$error":"#N/A"},{"$error":"#N/A"},72.20000000000049,{"$error":"#N/A"},{"$error":"#N/A"},{"$error":"#N/A"}]
[{"$nulls":5},{"$error":"#N/A"},72.40000000000049,{"$error":"#N/A"},{"$error":"#N/A"},{"$error":"#N/A"},{"$error":"#N/A"},72.40000000000049,{"$error":"#N/A"},{"$error":"#N/A"},{"$error":"#N/A"},{"$error":"#N/A"},72.40000000000049,{"$error":"#N/A"},{"$error":"#N/A"},{"$error":"#N/A"}]
[{"$nulls":5},{"$error":"#N/A"},72.60000000000049,{"$error":"#N/A"},{"$error":"#N/A"},{"$error":"#N/A"},{"$error":"#N/A"},72.60000000000049,{"$error":"#N/A"},{"$error":"#N/A"},{"$error":"#N/A"},{"$error":"#N/A"},72.60000000000049,{"$error":"#N/A"},{"$error":"#N/A"},{"$error":"#N/A"}]
[{"$nulls":5},{"$error":"#N/A"},72.8000000000005,{"$error":"#N/A"},{"$error":"#N/A"},{"$error":"#N/A"},{"$error":"#N/A"},72.8000000000005,{"$error":"#N/A"},{"$error":"#N/A"},{"$error":"#N/A"},{"$error":"#N/A"},72.8000000000005,{"$error":"#N/A"},{"$error":"#N/A"},{"$error":"#N/A"}]
[{"$nulls":5},{"$error":"#N/A"},73.0000000000005,{"$error":"#N/A"},{"$error":"#N/A"},{"$error":"#N/A"},{"$error":"#N/A"},73.0000000000005,{"$error":"#N/A"},{"$error":"#N/A"},{"$error":"#N/A"},{"$error":"#N/A"},73.0000000000005,{"$error":"#N/A"},{"$error":"#N/A"},{"$error":"#N/A"}]
[{"$nulls":5},{"$error":"#N/A"},73.2000000000005,{"$error":"#N/A"},{"$error":"#N/A"},{"$error":"#N/A"},{"$error":"#N/A"},73.2000000000005,{"$error":"#N/A"},{"$error":"#N/A"},{"$error":"#N/A"},{"$error":"#N/A"},73.2000000000005,{"$error":"#N/A"},{"$error":"#N/A"},{"$error":"#N/A"}]
[{"$nulls":5},{"$error":"#N/A"},73.4000000000005,{"$error":"#N/A"},{"$error":"#N/A"},{"$error":"#N/A"},{"$error":"#N/A"},73.4000000000005,{"$error":"#N/A"},{"$error":"#N/A"},{"$error":"#N/A"},{"$error":"#N/A"},73.4000000000005,{"$error":"#N/A"},{"$error":"#N/A"},{"$error":"#N/A"}]
[{"$nulls":5},{"$error":"#N/A"},73.6000000000005,{"$error":"#N/A"},{"$error":"#N/A"},{"$error":"#N/A"},{"$error":"#N/A"},73.6000000000005,{"$error":"#N/A"},{"$error":"#N/A"},{"$error":"#N/A"},{"$error":"#N/A"},73.6000000000005,{"$error":"#N/A"},{"$error":"#N/A"},{"$error":"#N/A"}]
[{"$nulls":5},{"$f":"IF(F371<$I$2,F371+30,NA())","v":{"$error":"#N/A"}},{"$f":"G371+$G$2","v":73.80000000000051},{"$f":"-1+COS(F372*PI()/180)+G372","v":{"$error":"#N/A"}},{"$f":"(F372/$I$2)*($D$8-$D$7)+COS(F372*PI()/180)+$D$7-1","v":{"$error":"#N/A"}},{"$f":"$J$2*SIN(F372*PI()/180)+$B$18","v":{"$error":"#N/A"}},{"$error":"#N/A"},73.80000000000051,{"$f":"-1+COS(K372*PI()/180)+L372","v":{"$error":"#N/A"}},{"$f":"(K372/$N$2)*($D$13-$D$12)+COS(K372*PI()/180)+$D$12-1","v":{"$error":"#N/A"}},{"$f":"$O$2*SIN(K372*PI()/180)+$B$19","v":{"$error":"#N/A"}},{"$error":"#N/A"},{"$f":"Q371+$G$2","v":73.80000000000051},{"$f":"-1+COS(P372*PI()/180)+Q372","v":{"$error":"#N/A"}},{"$f":"(P372/$S$2)*($D$18-$D$17)+COS(P372*PI()/180)+$D$17-1","v":{"$error":"#N/A"}},{"$f":"$T$2*SIN(P372*PI()/180)+$B$20","v":{"$error":"#N/A"}}]
[{"$nulls":5},{"$error":"#N/A"},74.00000000000051,{"$error":"#N/A"},{"$error":"#N/A"},{"$error":"#N/A"},{"$error":"#N/A"},74.00000000000051,{"$error":"#N/A"},{"$error":"#N/A"},{"$error":"#N/A"},{"$error":"#N/A"},74.00000000000051,{"$error":"#N/A"},{"$error":"#N/A"},{"$error":"#N/A"}]
[{"$nulls":5},{"$error":"#N/A"},74.20000000000051,{"$error":"#N/A"},{"$error":"#N/A"},{"$error":"#N/A"},{"$error":"#N/A"},74.20000000000051,{"$error":"#N/A"},{"$error":"#N/A"},{"$error":"#N/A"},{"$error":"#N/A"},74.20000000000051,{"$error":"#N/A"},{"$error":"#N/A"},{"$error":"#N/A"}]
[{"$nulls":5},{"$error":"#N/A"},74.40000000000052,{"$error":"#N/A"},{"$error":"#N/A"},{"$error":"#N/A"},{"$error":"#N/A"},74.40000000000052,{"$error":"#N/A"},{"$error":"#N/A"},{"$error":"#N/A"},{"$error":"#N/A"},74.40000000000052,{"$error":"#N/A"},{"$error":"#N/A"},{"$error":"#N/A"}]
[{"$nulls":5},{"$error":"#N/A"},74.60000000000052,{"$error":"#N/A"},{"$error":"#N/A"},{"$error":"#N/A"},{"$error":"#N/A"},74.60000000000052,{"$error":"#N/A"},{"$error":"#N/A"},{"$error":"#N/A"},{"$error":"#N/A"},74.60000000000052,{"$error":"#N/A"},{"$error":"#N/A"},{"$error":"#N/A"}]
[{"$nulls":5},{"$error":"#N/A"},74.80000000000052,{"$error":"#N/A"},{"$error":"#N/A"},{"$error":"#N/A"},{"$error":"#N/A"},74.80000000000052,{"$error":"#N/A"},{"$error":"#N/A"},{"$error":"#N/A"},{"$error":"#N/A"},74.80000000000052,{"$error":"#N/A"},{"$error":"#N/A"},{"$error":"#N/A"}]
[{"$nulls":5},{"$error":"#N/A"},75.00000000000053,{"$error":"#N/A"},{"$error":"#N/A"},{"$error":"#N/A"},{"$error":"#N/A"},75.00000000000053,{"$error":"#N/A"},{"$error":"#N/A"},{"$error":"#N/A"},{"$error":"#N/A"},75.00000000000053,{"$error":"#N/A"},{"$error":"#N/A"},{"$error":"#N/A"}]
[{"$nulls":5},{"$error":"#N/A"},75.20000000000053,{"$error":"#N/A"},{"$error":"#N/A"},{"$error":"#N/A"},{"$error":"#N/A"},75.20000000000053,{"$error":"#N/A"},{"$error":"#N/A"},{"$error":"#N/A"},{"$error":"#N/A"},75.20000000000053,{"$error":"#N/A"},{"$error":"#N/A"},{"$error":"#N/A"}]
[{"$nulls":5},{"$error":"#N/A"},75.40000000000053,{"$error":"#N/A"},{"$error":"#N/A"},{"$error":"#N/A"},{"$error":"#N/A"},75.40000000000053,{"$error":"#N/A"},{"$error":"#N/A"},{"$error":"#N/A"},{"$error":"#N/A"},75.40000000000053,{"$error":"#N/A"},{"$error":"#N/A"},{"$error":"#N/A"}]
[{"$nulls":5},{"$error":"#N/A"},75.60000000000053,{"$error":"#N/A"},{"$error":"#N/A"},{"$error":"#N/A"},{"$error":"#N/A"},75.60000000000053,{"$error":"#N/A"},{"$error":"#N/A"},{"$error":"#N/A"},{"$error":"#N/A"},75.60000000000053,{"$error":"#N/A"},{"$error":"#N/A"},{"$error":"#N/A"}]
[{"$nulls":5},{"$error":"#N/A"},75.80000000000054,{"$error":"#N/A"},{"$error":"#N/A"},{"$error":"#N/A"},{"$error":"#N/A"},75.80000000000054,{"$error":"#N/A"},{"$error":"#N/A"},{"$error":"#N/A"},{"$error":"#N/A"},75.80000000000054,{"$error":"#N/A"},{"$error":"#N/A"},{"$error":"#N/A"}]
[{"$nulls":5},{"$error":"#N/A"},76.00000000000054,{"$error":"#N/A"},{"$error":"#N/A"},{"$error":"#N/A"},{"$error":"#N/A"},76.00000000000054,{"$error":"#N/A"},{"$error":"#N/A"},{"$error":"#N/A"},{"$error":"#N/A"},76.00000000000054,{"$error":"#N/A"},{"$error":"#N/A"},{"$error":"#N/A"}]
[{"$nulls":5},{"$error":"#N/A"},76.20000000000054,{"$error":"#N/A"},{"$error":"#N/A"},{"$error":"#N/A"},{"$error":"#N/A"},76.20000000000054,{"$error":"#N/A"},{"$error":"#N/A"},{"$error":"#N/A"},{"$error":"#N/A"},76.20000000000054,{"$error":"#N/A"},{"$error":"#N/A"},{"$error":"#N/A"}]
[{"$nulls":5},{"$error":"#N/A"},76.40000000000055,{"$error":"#N/A"},{"$error":"#N/A"},{"$error":"#N/A"},{"$error":"#N/A"},76.40000000000055,{"$error":"#N/A"},{"$error":"#N/A"},{"$error":"#N/A"},{"$error":"#N/A"},76.40000000000055,{"$error":"#N/A"},{"$error":"#N/A"},{"$error":"#N/A"}]
[{"$nulls":5},{"$error":"#N/A"},76.60000000000055,{"$error":"#N/A"},{"$error":"#N/A"},{"$error":"#N/A"},{"$error":"#N/A"},76.60000000000055,{"$error":"#N/A"},{"$error":"#N/A"},{"$error":"#N/A"},{"$error":"#N/A"},76.60000000000055,{"$error":"#N/A"},{"$error":"#N/A"},{"$error":"#N/A"}]
[{"$nulls":5},{"$error":"#N/A"},76.80000000000055,{"$error":"#N/A"},{"$error":"#N/A"},{"$error":"#N/A"},{"$error":"#N/A"},76.80000000000055,{"$error":"#N/A"},{"$error":"#N/A"},{"$error":"#N/A"},{"$error":"#N/A"},76.80000000000055,{"$error":"#N/A"},{"$error":"#N/A"},{"$error":"#N/A"}]
[{"$nulls":5},{"$error":"#N/A"},77.00000000000055,{"$error":"#N/A"},{"$error":"#N/A"},{"$error":"#N/A"},{"$error":"#N/A"},77.00000000000055,{"$error":"#N/A"},{"$error":"#N/A"},{"$error":"#N/A"},{"$error":"#N/A"},77.00000000000055,{"$error":"#N/A"},{"$error":"#N/A"},{"$error":"#N/A"}]
[{"$nulls":5},{"$error":"#N/A"},77.20000000000056,{"$error":"#N/A"},{"$error":"#N/A"},{"$error":"#N/A"},{"$f":"IF(K388<$N$2,K388+30,NA())","v":{"$error":"#N/A"}},{"$f":"L388+$L$2","v":77.20000000000056},{"$error":"#N/A"},{"$error":"#N/A"},{"$error":"#N/A"},{"$f":"IF(P388<$S$2,P388+30,NA())","v":{"$error":"#N/A"}},77.20000000000056,{"$error":"#N/A"},{"$error":"#N/A"},{"$error":"#N/A"}]
[{"$nulls":5},{"$error":"#N/A"},77.40000000000056,{"$error":"#N/A"},{"$error":"#N/A"},{"$error":"#N/A"},{"$error":"#N/A"},77.40000000000056,{"$error":"#N/A"},{"$error":"#N/A"},{"$error":"#N/A"},{"$error":"#N/A"},77.40000000000056,{"$error":"#N/A"},{"$error":"#N/A"},{"$error":"#N/A"}]
[{"$nulls":5},{"$error":"#N/A"},77.60000000000056,{"$error":"#N/A"},{"$error":"#N/A"},{"$error":"#N/A"},{"$error":"#N/A"},77.60000000000056,{"$error":"#N/A"},{"$error":"#N/A"},{"$error":"#N/A"},{"$error":"#N/A"},77.60000000000056,{"$error":"#N/A"},{"$error":"#N/A"},{"$error":"#N/A"}]
[{"$nulls":5},{"$error":"#N/A"},77.80000000000057,{"$error":"#N/A"},{"$error":"#N/A"},{"$error":"#N/A"},{"$error":"#N/A"},77.80000000000057,{"$error":"#N/A"},{"$error":"#N/A"},{"$error":"#N/A"},{"$error":"#N/A"},77.80000000000057,{"$error":"#N/A"},{"$error":"#N/A"},{"$error":"#N/A"}]
[{"$nulls":5},{"$error":"#N/A"},78.00000000000057,{"$error":"#N/A"},{"$error":"#N/A"},{"$error":"#N/A"},{"$error":"#N/A"},78.00000000000057,{"$error":"#N/A"},{"$error":"#N/A"},{"$error":"#N/A"},{"$error":"#N/A"},78.00000000000057,{"$error":"#N/A"},{"$error":"#N/A"},{"$error":"#N/A"}]
[{"$nulls":5},{"$error":"#N/A"},78.20000000000057,{"$error":"#N/A"},{"$error":"#N/A"},{"$error":"#N/A"},{"$error":"#N/A"},78.20000000000057,{"$error":"#N/A"},{"$error":"#N/A"},{"$error":"#N/A"},{"$error":"#N/A"},78.20000000000057,{"$error":"#N/A"},{"$error":"#N/A"},{"$error":"#N/A"}]
[{"$nulls":5},{"$error":"#N/A"},78.40000000000057,{"$error":"#N/A"},{"$error":"#N/A"},{"$error":"#N/A"},{"$error":"#N/A"},78.40000000000057,{"$error":"#N/A"},{"$error":"#N/A"},{"$error":"#N/A"},{"$error":"#N/A"},78.40000000000057,{"$error":"#N/A"},{"$error":"#N/A"},{"$error":"#N/A"}]
[{"$nulls":5},{"$error":"#N/A"},78.60000000000058,{"$error":"#N/A"},{"$error":"#N/A"},{"$error":"#N/A"},{"$error":"#N/A"},78.60000000000058,{"$error":"#N/A"},{"$error":"#N/A"},{"$error":"#N/A"},{"$error":"#N/A"},78.60000000000058,{"$error":"#N/A"},{"$error":"#N/A"},{"$error":"#N/A"}]
[{"$nulls":5},{"$error":"#N/A"},78.80000000000058,{"$error":"#N/A"},{"$error":"#N/A"},{"$error":"#N/A"},{"$error":"#N/A"},78.80000000000058,{"$error":"#N/A"},{"$error":"#N/A"},{"$error":"#N/A"},{"$error":"#N/A"},78.80000000000058,{"$error":"#N/A"},{"$error":"#N/A"},{"$error":"#N/A"}]
[{"$nulls":5},{"$error":"#N/A"},79.00000000000058,{"$error":"#N/A"},{"$error":"#N/A"},{"$error":"#N/A"},{"$error":"#N/A"},79.00000000000058,{"$error":"#N/A"},{"$error":"#N/A"},{"$error":"#N/A"},{"$error":"#N/A"},79.00000000000058,{"$error":"#N/A"},{"$error":"#N/A"},{"$error":"#N/A"}]
[{"$nulls":5},{"$error":"#N/A"},79.20000000000059,{"$error":"#N/A"},{"$error":"#N/A"},{"$error":"#N/A"},{"$error":"#N/A"},79.20000000000059,{"$error":"#N/A"},{"$error":"#N/A"},{"$error":"#N/A"},{"$error":"#N/A"},79.20000000000059,{"$error":"#N/A"},{"$error":"#N/A"},{"$error":"#N/A"}]
[{"$nulls":5},{"$error":"#N/A"},79.40000000000059,{"$error":"#N/A"},{"$error":"#N/A"},{"$error":"#N/A"},{"$error":"#N/A"},79.40000000000059,{"$error":"#N/A"},{"$error":"#N/A"},{"$error":"#N/A"},{"$error":"#N/A"},79.40000000000059,{"$error":"#N/A"},{"$error":"#N/A"},{"$error":"#N/A"}]
[{"$nulls":5},{"$error":"#N/A"},79.60000000000059,{"$error":"#N/A"},{"$error":"#N/A"},{"$error":"#N/A"},{"$error":"#N/A"},79.60000000000059,{"$error":"#N/A"},{"$error":"#N/A"},{"$error":"#N/A"},{"$error":"#N/A"},79.60000000000059,{"$error":"#N/A"},{"$error":"#N/A"},{"$error":"#N/A"}]
[{"$nulls":5},{"$error":"#N/A"},79.8000000000006,{"$error":"#N/A"},{"$error":"#N/A"},{"$error":"#N/A"},{"$error":"#N/A"},79.8000000000006,{"$error":"#N/A"},{"$error":"#N/A"},{"$error":"#N/A"},{"$error":"#N/A"},79.8000000000006,{"$error":"#N/A"},{"$error":"#N/A"},{"$error":"#N/A"}]
[{"$nulls":5},{"$error":"#N/A"},80.0000000000006,{"$error":"#N/A"},{"$error":"#N/A"},{"$error":"#N/A"},{"$error":"#N/A"},80.0000000000006,{"$error":"#N/A"},{"$error":"#N/A"},{"$error":"#N/A"},{"$error":"#N/A"},80.0000000000006,{"$error":"#N/A"},{"$error":"#N/A"},{"$error":"#N/A"}]
[{"$nulls":5},{"$error":"#N/A"},80.2000000000006,{"$error":"#N/A"},{"$error":"#N/A"},{"$error":"#N/A"},{"$error":"#N/A"},80.2000000000006,{"$error":"#N/A"},{"$error":"#N/A"},{"$error":"#N/A"},{"$error":"#N/A"},80.2000000000006,{"$error":"#N/A"},{"$error":"#N/A"},{"$error":"#N/A"}]
[{"$nulls":5},{"$error":"#N/A"},80.4000000000006,{"$error":"#N/A"},{"$error":"#N/A"},{"$error":"#N/A"},{"$error":"#N/A"},80.4000000000006,{"$error":"#N/A"},{"$error":"#N/A"},{"$error":"#N/A"},{"$error":"#N/A"},80.4000000000006,{"$error":"#N/A"},{"$error":"#N/A"},{"$error":"#N/A"}]
[{"$nulls":5},{"$error":"#N/A"},80.6000000000006,{"$error":"#N/A"},{"$error":"#N/A"},{"$error":"#N/A"},{"$error":"#N/A"},80.6000000000006,{"$error":"#N/A"},{"$error":"#N/A"},{"$error":"#N/A"},{"$error":"#N/A"},80.6000000000006,{"$error":"#N/A"},{"$error":"#N/A"},{"$error":"#N/A"}]
[{"$nulls":5},{"$error":"#N/A"},80.80000000000061,{"$error":"#N/A"},{"$error":"#N/A"},{"$error":"#N/A"},{"$error":"#N/A"},80.80000000000061,{"$error":"#N/A"},{"$error":"#N/A"},{"$error":"#N/A"},{"$error":"#N/A"},80.80000000000061,{"$error":"#N/A"},{"$error":"#N/A"},{"$error":"#N/A"}]
[{"$nulls":5},{"$error":"#N/A"},81.00000000000061,{"$error":"#N/A"},{"$error":"#N/A"},{"$error":"#N/A"},{"$error":"#N/A"},81.00000000000061,{"$error":"#N/A"},{"$error":"#N/A"},{"$error":"#N/A"},{"$error":"#N/A"},81.00000000000061,{"$error":"#N/A"},{"$error":"#N/A"},{"$error":"#N/A"}]
[{"$nulls":5},{"$error":"#N/A"},81.20000000000061,{"$error":"#N/A"},{"$error":"#N/A"},{"$error":"#N/A"},{"$error":"#N/A"},81.20000000000061,{"$error":"#N/A"},{"$error":"#N/A"},{"$error":"#N/A"},{"$error":"#N/A"},81.20000000000061,{"$error":"#N/A"},{"$error":"#N/A"},{"$error":"#N/A"}]
[{"$nulls":5},{"$error":"#N/A"},81.40000000000062,{"$error":"#N/A"},{"$error":"#N/A"},{"$error":"#N/A"},{"$error":"#N/A"},81.40000000000062,{"$error":"#N/A"},{"$error":"#N/A"},{"$error":"#N/A"},{"$error":"#N/A"},81.40000000000062,{"$error":"#N/A"},{"$error":"#N/A"},{"$error":"#N/A"}]
[{"$nulls":5},{"$error":"#N/A"},81.60000000000062,{"$error":"#N/A"},{"$error":"#N/A"},{"$error":"#N/A"},{"$error":"#N/A"},81.60000000000062,{"$error":"#N/A"},{"$error":"#N/A"},{"$error":"#N/A"},{"$error":"#N/A"},81.60000000000062,{"$error":"#N/A"},{"$error":"#N/A"},{"$error":"#N/A"}]
[{"$nulls":5},{"$error":"#N/A"},81.80000000000062,{"$error":"#N/A"},{"$error":"#N/A"},{"$error":"#N/A"},{"$error":"#N/A"},81.80000000000062,{"$error":"#N/A"},{"$error":"#N/A"},{"$error":"#N/A"},{"$error":"#N/A"},81.80000000000062,{"$error":"#N/A"},{"$error":"#N/A"},{"$error":"#N/A"}]
[{"$nulls":5},{"$error":"#N/A"},82.00000000000063,{"$error":"#N/A"},{"$error":"#N/A"},{"$error":"#N/A"},{"$error":"#N/A"},82.00000000000063,{"$error":"#N/A"},{"$error":"#N/A"},{"$error":"#N/A"},{"$error":"#N/A"},82.00000000000063,{"$error":"#N/A"},{"$error":"#N/A"},{"$error":"#N/A"}]
[{"$nulls":5},{"$error":"#N/A"},82.20000000000063,{"$error":"#N/A"},{"$error":"#N/A"},{"$error":"#N/A"},{"$error":"#N/A"},82.20000000000063,{"$error":"#N/A"},{"$error":"#N/A"},{"$error":"#N/A"},{"$error":"#N/A"},82.20000000000063,{"$error":"#N/A"},{"$error":"#N/A"},{"$error":"#N/A"}]
[{"$nulls":5},{"$error":"#N/A"},82.40000000000063,{"$error":"#N/A"},{"$error":"#N/A"},{"$error":"#N/A"},{"$error":"#N/A"},82.40000000000063,{"$error":"#N/A"},{"$error":"#N/A"},{"$error":"#N/A"},{"$error":"#N/A"},82.40000000000063,{"$error":"#N/A"},{"$error":"#N/A"},{"$error":"#N/A"}]
[{"$nulls":5},{"$error":"#N/A"},82.60000000000063,{"$error":"#N/A"},{"$error":"#N/A"},{"$error":"#N/A"},{"$error":"#N/A"},82.60000000000063,{"$error":"#N/A"},{"$error":"#N/A"},{"$error":"#N/A"},{"$error":"#N/A"},82.60000000000063,{"$error":"#N/A"},{"$error":"#N/A"},{"$error":"#N/A"}]
[{"$nulls":5},{"$error":"#N/A"},82.80000000000064,{"$error":"#N/A"},{"$error":"#N/A"},{"$error":"#N/A"},{"$error":"#N/A"},82.80000000000064,{"$error":"#N/A"},{"$error":"#N/A"},{"$error":"#N/A"},{"$error":"#N/A"},82.80000000000064,{"$error":"#N/A"},{"$error":"#N/A"},{"$error":"#N/A"}]
[{"$nulls":5},{"$error":"#N/A"},83.00000000000064,{"$error":"#N/A"},{"$error":"#N/A"},{"$error":"#N/A"},{"$error":"#N/A"},83.00000000000064,{"$error":"#N/A"},{"$error":"#N/A"},{"$error":"#N/A"},{"$error":"#N/A"},83.00000000000064,{"$error":"#N/A"},{"$error":"#N/A"},{"$error":"#N/A"}]
[{"$nulls":5},{"$error":"#N/A"},83.20000000000064,{"$error":"#N/A"},{"$error":"#N/A"},{"$error":"#N/A"},{"$error":"#N/A"},83.20000000000064,{"$error":"#N/A"},{"$error":"#N/A"},{"$error":"#N/A"},{"$error":"#N/A"},83.20000000000064,{"$error":"#N/A"},{"$error":"#N/A"},{"$error":"#N/A"}]
[{"$nulls":5},{"$error":"#N/A"},83.40000000000065,{"$error":"#N/A"},{"$error":"#N/A"},{"$error":"#N/A"},{"$error":"#N/A"},83.40000000000065,{"$error":"#N/A"},{"$error":"#N/A"},{"$error":"#N/A"},{"$error":"#N/A"},83.40000000000065,{"$error":"#N/A"},{"$error":"#N/A"},{"$error":"#N/A"}]
[{"$nulls":5},{"$error":"#N/A"},83.60000000000065,{"$error":"#N/A"},{"$error":"#N/A"},{"$error":"#N/A"},{"$error":"#N/A"},83.60000000000065,{"$error":"#N/A"},{"$error":"#N/A"},{"$error":"#N/A"},{"$error":"#N/A"},83.60000000000065,{"$error":"#N/A"},{"$error":"#N/A"},{"$error":"#N/A"}]
[{"$nulls":5},{"$error":"#N/A"},83.80000000000065,{"$error":"#N/A"},{"$error":"#N/A"},{"$error":"#N/A"},{"$error":"#N/A"},83.80000000000065,{"$error":"#N/A"},{"$error":"#N/A"},{"$error":"#N/A"},{"$error":"#N/A"},83.80000000000065,{"$error":"#N/A"},{"$error":"#N/A"},{"$error":"#N/A"}]
[{"$nulls":5},{"$error":"#N/A"},84.00000000000065,{"$error":"#N/A"},{"$error":"#N/A"},{"$error":"#N/A"},{"$error":"#N/A"},84.00000000000065,{"$error":"#N/A"},{"$error":"#N/A"},{"$error":"#N/A"},{"$error":"#N/A"},84.00000000000065,{"$error":"#N/A"},{"$error":"#N/A"},{"$error":"#N/A"}]
[{"$nulls":5},{"$error":"#N/A"},84.20000000000066,{"$error":"#N/A"},{"$error":"#N/A"},{"$error":"#N/A"},{"$error":"#N/A"},84.20000000000066,{"$error":"#N/A"},{"$error":"#N/A"},{"$error":"#N/A"},{"$error":"#N/A"},84.20000000000066,{"$error":"#N/A"},{"$error":"#N/A"},{"$error":"#N/A"}]
[{"$nulls":5},{"$error":"#N/A"},84.40000000000066,{"$error":"#N/A"},{"$error":"#N/A"},{"$error":"#N/A"},{"$error":"#N/A"},84.40000000000066,{"$error":"#N/A"},{"$error":"#N/A"},{"$error":"#N/A"},{"$error":"#N/A"},84.40000000000066,{"$error":"#N/A"},{"$error":"#N/A"},{"$error":"#N/A"}]
[{"$nulls":5},{"$error":"#N/A"},84.60000000000066,{"$error":"#N/A"},{"$error":"#N/A"},{"$error":"#N/A"},{"$error":"#N/A"},84.60000000000066,{"$error":"#N/A"},{"$error":"#N/A"},{"$error":"#N/A"},{"$error":"#N/A"},84.60000000000066,{"$error":"#N/A"},{"$error":"#N/A"},{"$error":"#N/A"}]
[{"$nulls":5},{"$error":"#N/A"},84.80000000000067,{"$error":"#N/A"},{"$error":"#N/A"},{"$error":"#N/A"},{"$error":"#N/A"},84.80000000000067,{"$error":"#N/A"},{"$error":"#N/A"},{"$error":"#N/A"},{"$error":"#N/A"},84.80000000000067,{"$error":"#N/A"},{"$error":"#N/A"},{"$error":"#N/A"}]
[{"$nulls":5},{"$error":"#N/A"},85.00000000000067,{"$error":"#N/A"},{"$error":"#N/A"},{"$error":"#N/A"},{"$error":"#N/A"},85.00000000000067,{"$error":"#N/A"},{"$error":"#N/A"},{"$error":"#N/A"},{"$error":"#N/A"},85.00000000000067,{"$error":"#N/A"},{"$error":"#N/A"},{"$error":"#N/A"}]
[{"$nulls":5},{"$error":"#N/A"},85.20000000000067,{"$error":"#N/A"},{"$error":"#N/A"},{"$error":"#N/A"},{"$error":"#N/A"},85.20000000000067,{"$error":"#N/A"},{"$error":"#N/A"},{"$error":"#N/A"},{"$error":"#N/A"},85.20000000000067,{"$error":"#N/A"},{"$error":"#N/A"},{"$error":"#N/A"}]
[{"$nulls":5},{"$error":"#N/A"},85.40000000000067,{"$error":"#N/A"},{"$error":"#N/A"},{"$error":"#N/A"},{"$error":"#N/A"},85.40000000000067,{"$error":"#N/A"},{"$error":"#N/A"},{"$error":"#N/A"},{"$error":"#N/A"},85.40000000000067,{"$error":"#N/A"},{"$error":"#N/A"},{"$error":"#N/A"}]
[{"$nulls":5},{"$error":"#N/A"},85.60000000000068,{"$error":"#N/A"},{"$error":"#N/A"},{"$error":"#N/A"},{"$error":"#N/A"},85.60000000000068,{"$error":"#N/A"},{"$error":"#N/A"},{"$error":"#N/A"},{"$error":"#N/A"},85.60000000000068,{"$error":"#N/A"},{"$error":"#N/A"},{"$error":"#N/A"}]
[{"$nulls":5},{"$error":"#N/A"},85.80000000000068,{"$error":"#N/A"},{"$error":"#N/A"},{"$error":"#N/A"},{"$error":"#N/A"},85.80000000000068,{"$error":"#N/A"},{"$error":"#N/A"},{"$error":"#N/A"},{"$error":"#N/A"},85.80000000000068,{"$error":"#N/A"},{"$error":"#N/A"},{"$error":"#N/A"}]
[{"$nulls":5},{"$error":"#N/A"},86.00000000000068,{"$error":"#N/A"},{"$error":"#N/A"},{"$error":"#N/A"},{"$error":"#N/A"},86.00000000000068,{"$error":"#N/A"},{"$error":"#N/A"},{"$error":"#N/A"},{"$error":"#N/A"},86.00000000000068,{"$error":"#N/A"},{"$error":"#N/A"},{"$error":"#N/A"}]
[{"$nulls":5},{"$error":"#N/A"},86.20000000000068,{"$error":"#N/A"},{"$error":"#N/A"},{"$error":"#N/A"},{"$error":"#N/A"},86.20000000000068,{"$error":"#N/A"},{"$error":"#N/A"},{"$error":"#N/A"},{"$error":"#N/A"},86.20000000000068,{"$error":"#N/A"},{"$error":"#N/A"},{"$error":"#N/A"}]
[{"$nulls":5},{"$error":"#N/A"},86.40000000000069,{"$error":"#N/A"},{"$error":"#N/A"},{"$error":"#N/A"},{"$error":"#N/A"},86.40000000000069,{"$error":"#N/A"},{"$error":"#N/A"},{"$error":"#N/A"},{"$error":"#N/A"},86.40000000000069,{"$error":"#N/A"},{"$error":"#N/A"},{"$error":"#N/A"}]
[{"$nulls":5},{"$f":"IF(F435<$I$2,F435+30,NA())","v":{"$error":"#N/A"}},{"$f":"G435+$G$2","v":86.60000000000069},{"$f":"-1+COS(F436*PI()/180)+G436","v":{"$error":"#N/A"}},{"$f":"(F436/$I$2)*($D$8-$D$7)+COS(F436*PI()/180)+$D$7-1","v":{"$error":"#N/A"}},{"$f":"$J$2*SIN(F436*PI()/180)+$B$18","v":{"$error":"#N/A"}},{"$error":"#N/A"},86.60000000000069,{"$f":"-1+COS(K436*PI()/180)+L436","v":{"$error":"#N/A"}},{"$f":"(K436/$N$2)*($D$13-$D$12)+COS(K436*PI()/180)+$D$12-1","v":{"$error":"#N/A"}},{"$f":"$O$2*SIN(K436*PI()/180)+$B$19","v":{"$error":"#N/A"}},{"$error":"#N/A"},{"$f":"Q435+$G$2","v":86.60000000000069},{"$f":"-1+COS(P436*PI()/180)+Q436","v":{"$error":"#N/A"}},{"$f":"(P436/$S$2)*($D$18-$D$17)+COS(P436*PI()/180)+$D$17-1","v":{"$error":"#N/A"}},{"$f":"$T$2*SIN(P436*PI()/180)+$B$20","v":{"$error":"#N/A"}}]
[{"$nulls":5},{"$error":"#N/A"},86.8000000000007,{"$error":"#N/A"},{"$error":"#N/A"},{"$error":"#N/A"},{"$error":"#N/A"},86.8000000000007,{"$error":"#N/A"},{"$error":"#N/A"},{"$error":"#N/A"},{"$error":"#N/A"},86.8000000000007,{"$error":"#N/A"},{"$error":"#N/A"},{"$error":"#N/A"}]
[{"$nulls":5},{"$error":"#N/A"},87.0000000000007,{"$error":"#N/A"},{"$error":"#N/A"},{"$error":"#N/A"},{"$error":"#N/A"},87.0000000000007,{"$error":"#N/A"},{"$error":"#N/A"},{"$error":"#N/A"},{"$error":"#N/A"},87.0000000000007,{"$error":"#N/A"},{"$error":"#N/A"},{"$error":"#N/A"}]
[{"$nulls":5},{"$error":"#N/A"},87.2000000000007,{"$error":"#N/A"},{"$error":"#N/A"},{"$error":"#N/A"},{"$error":"#N/A"},87.2000000000007,{"$error":"#N/A"},{"$error":"#N/A"},{"$error":"#N/A"},{"$error":"#N/A"},87.2000000000007,{"$error":"#N/A"},{"$error":"#N/A"},{"$error":"#N/A"}]
[{"$nulls":5},{"$error":"#N/A"},87.4000000000007,{"$error":"#N/A"},{"$error":"#N/A"},{"$error":"#N/A"},{"$error":"#N/A"},87.4000000000007,{"$error":"#N/A"},{"$error":"#N/A"},{"$error":"#N/A"},{"$error":"#N/A"},87.4000000000007,{"$error":"#N/A"},{"$error":"#N/A"},{"$error":"#N/A"}]
[{"$nulls":5},{"$error":"#N/A"},87.6000000000007,{"$error":"#N/A"},{"$error":"#N/A"},{"$error":"#N/A"},{"$error":"#N/A"},87.6000000000007,{"$error":"#N/A"},{"$error":"#N/A"},{"$error":"#N/A"},{"$error":"#N/A"},87.6000000000007,{"$error":"#N/A"},{"$error":"#N/A"},{"$error":"#N/A"}]
[{"$nulls":5},{"$error":"#N/A"},87.80000000000071,{"$error":"#N/A"},{"$error":"#N/A"},{"$error":"#N/A"},{"$error":"#N/A"},87.80000000000071,{"$error":"#N/A"},{"$error":"#N/A"},{"$error":"#N/A"},{"$error":"#N/A"},87.80000000000071,{"$error":"#N/A"},{"$error":"#N/A"},{"$error":"#N/A"}]
[{"$nulls":5},{"$error":"#N/A"},88.00000000000071,{"$error":"#N/A"},{"$error":"#N/A"},{"$error":"#N/A"},{"$error":"#N/A"},88.00000000000071,{"$error":"#N/A"},{"$error":"#N/A"},{"$error":"#N/A"},{"$error":"#N/A"},88.00000000000071,{"$error":"#N/A"},{"$error":"#N/A"},{"$error":"#N/A"}]
[{"$nulls":5},{"$error":"#N/A"},88.20000000000071,{"$error":"#N/A"},{"$error":"#N/A"},{"$error":"#N/A"},{"$error":"#N/A"},88.20000000000071,{"$error":"#N/A"},{"$error":"#N/A"},{"$error":"#N/A"},{"$error":"#N/A"},88.20000000000071,{"$error":"#N/A"},{"$error":"#N/A"},{"$error":"#N/A"}]
[{"$nulls":5},{"$error":"#N/A"},88.40000000000072,{"$error":"#N/A"},{"$error":"#N/A"},{"$error":"#N/A"},{"$error":"#N/A"},88.40000000000072,{"$error":"#N/A"},{"$error":"#N/A"},{"$error":"#N/A"},{"$error":"#N/A"},88.40000000000072,{"$error":"#N/A"},{"$error":"#N/A"},{"$error":"#N/A"}]
[{"$nulls":5},{"$error":"#N/A"},88.60000000000072,{"$error":"#N/A"},{"$error":"#N/A"},{"$error":"#N/A"},{"$error":"#N/A"},88.60000000000072,{"$error":"#N/A"},{"$error":"#N/A"},{"$error":"#N/A"},{"$error":"#N/A"},88.60000000000072,{"$error":"#N/A"},{"$error":"#N/A"},{"$error":"#N/A"}]
[{"$nulls":5},{"$error":"#N/A"},88.80000000000072,{"$error":"#N/A"},{"$error":"#N/A"},{"$error":"#N/A"},{"$error":"#N/A"},88.80000000000072,{"$error":"#N/A"},{"$error":"#N/A"},{"$error":"#N/A"},{"$error":"#N/A"},88.80000000000072,{"$error":"#N/A"},{"$error":"#N/A"},{"$error":"#N/A"}]
[{"$nulls":5},{"$error":"#N/A"},89.00000000000072,{"$error":"#N/A"},{"$error":"#N/A"},{"$error":"#N/A"},{"$error":"#N/A"},89.00000000000072,{"$error":"#N/A"},{"$error":"#N/A"},{"$error":"#N/A"},{"$error":"#N/A"},89.00000000000072,{"$error":"#N/A"},{"$error":"#N/A"},{"$error":"#N/A"}]
[{"$nulls":5},{"$error":"#N/A"},89.20000000000073,{"$error":"#N/A"},{"$error":"#N/A"},{"$error":"#N/A"},{"$error":"#N/A"},89.20000000000073,{"$error":"#N/A"},{"$error":"#N/A"},{"$error":"#N/A"},{"$error":"#N/A"},89.20000000000073,{"$error":"#N/A"},{"$error":"#N/A"},{"$error":"#N/A"}]
[{"$nulls":5},{"$error":"#N/A"},89.40000000000073,{"$error":"#N/A"},{"$error":"#N/A"},{"$error":"#N/A"},{"$error":"#N/A"},89.40000000000073,{"$error":"#N/A"},{"$error":"#N/A"},{"$error":"#N/A"},{"$error":"#N/A"},89.40000000000073,{"$error":"#N/A"},{"$error":"#N/A"},{"$error":"#N/A"}]
[{"$nulls":5},{"$error":"#N/A"},89.60000000000073,{"$error":"#N/A"},{"$error":"#N/A"},{"$error":"#N/A"},{"$error":"#N/A"},89.60000000000073,{"$error":"#N/A"},{"$error":"#N/A"},{"$error":"#N/A"},{"$error":"#N/A"},89.60000000000073,{"$error":"#N/A"},{"$error":"#N/A"},{"$error":"#N/A"}]
[{"$nulls":5},{"$error":"#N/A"},89.80000000000074,{"$error":"#N/A"},{"$error":"#N/A"},{"$error":"#N/A"},{"$error":"#N/A"},89.80000000000074,{"$error":"#N/A"},{"$error":"#N/A"},{"$error":"#N/A"},{"$error":"#N/A"},89.80000000000074,{"$error":"#N/A"},{"$error":"#N/A"},{"$error":"#N/A"}]
[{"$nulls":5},{"$error":"#N/A"},90.00000000000074,{"$error":"#N/A"},{"$error":"#N/A"},{"$error":"#N/A"},{"$f":"IF(K452<$N$2,K452+30,NA())","v":{"$error":"#N/A"}},{"$f":"L452+$L$2","v":90.00000000000074},{"$error":"#N/A"},{"$error":"#N/A"},{"$error":"#N/A"},{"$f":"IF(P452<$S$2,P452+30,NA())","v":{"$error":"#N/A"}},90.00000000000074,{"$error":"#N/A"},{"$error":"#N/A"},{"$error":"#N/A"}]
[{"$nulls":5},{"$error":"#N/A"},90.20000000000074,{"$error":"#N/A"},{"$error":"#N/A"},{"$error":"#N/A"},{"$error":"#N/A"},90.20000000000074,{"$error":"#N/A"},{"$error":"#N/A"},{"$error":"#N/A"},{"$error":"#N/A"},90.20000000000074,{"$error":"#N/A"},{"$error":"#N/A"},{"$error":"#N/A"}]
[{"$nulls":5},{"$error":"#N/A"},90.40000000000074,{"$error":"#N/A"},{"$error":"#N/A"},{"$error":"#N/A"},{"$error":"#N/A"},90.40000000000074,{"$error":"#N/A"},{"$error":"#N/A"},{"$error":"#N/A"},{"$error":"#N/A"},90.40000000000074,{"$error":"#N/A"},{"$error":"#N/A"},{"$error":"#N/A"}]
[{"$nulls":5},{"$error":"#N/A"},90.60000000000075,{"$error":"#N/A"},{"$error":"#N/A"},{"$error":"#N/A"},{"$error":"#N/A"},90.60000000000075,{"$error":"#N/A"},{"$error":"#N/A"},{"$error":"#N/A"},{"$error":"#N/A"},90.60000000000075,{"$error":"#N/A"},{"$error":"#N/A"},{"$error":"#N/A"}]
[{"$nulls":5},{"$error":"#N/A"},90.80000000000075,{"$error":"#N/A"},{"$error":"#N/A"},{"$error":"#N/A"},{"$error":"#N/A"},90.80000000000075,{"$error":"#N/A"},{"$error":"#N/A"},{"$error":"#N/A"},{"$error":"#N/A"},90.80000000000075,{"$error":"#N/A"},{"$error":"#N/A"},{"$error":"#N/A"}]
[{"$nulls":5},{"$error":"#N/A"},91.00000000000075,{"$error":"#N/A"},{"$error":"#N/A"},{"$error":"#N/A"},{"$error":"#N/A"},91.00000000000075,{"$error":"#N/A"},{"$error":"#N/A"},{"$error":"#N/A"},{"$error":"#N/A"},91.00000000000075,{"$error":"#N/A"},{"$error":"#N/A"},{"$error":"#N/A"}]
[{"$nulls":5},{"$error":"#N/A"},91.20000000000076,{"$error":"#N/A"},{"$error":"#N/A"},{"$error":"#N/A"},{"$error":"#N/A"},91.20000000000076,{"$error":"#N/A"},{"$error":"#N/A"},{"$error":"#N/A"},{"$error":"#N/A"},91.20000000000076,{"$error":"#N/A"},{"$error":"#N/A"},{"$error":"#N/A"}]
[{"$nulls":5},{"$error":"#N/A"},91.40000000000076,{"$error":"#N/A"},{"$error":"#N/A"},{"$error":"#N/A"},{"$error":"#N/A"},91.40000000000076,{"$error":"#N/A"},{"$error":"#N/A"},{"$error":"#N/A"},{"$error":"#N/A"},91.40000000000076,{"$error":"#N/A"},{"$error":"#N/A"},{"$error":"#N/A"}]
[{"$nulls":5},{"$error":"#N/A"},91.60000000000076,{"$error":"#N/A"},{"$error":"#N/A"},{"$error":"#N/A"},{"$error":"#N/A"},91.60000000000076,{"$error":"#N/A"},{"$error":"#N/A"},{"$error":"#N/A"},{"$error":"#N/A"},91.60000000000076,{"$error":"#N/A"},{"$error":"#N/A"},{"$error":"#N/A"}]
[{"$nulls":5},{"$error":"#N/A"},91.80000000000076,{"$error":"#N/A"},{"$error":"#N/A"},{"$error":"#N/A"},{"$error":"#N/A"},91.80000000000076,{"$error":"#N/A"},{"$error":"#N/A"},{"$error":"#N/A"},{"$error":"#N/A"},91.80000000000076,{"$error":"#N/A"},{"$error":"#N/A"},{"$error":"#N/A"}]
[{"$nulls":5},{"$error":"#N/A"},92.00000000000077,{"$error":"#N/A"},{"$error":"#N/A"},{"$error":"#N/A"},{"$error":"#N/A"},92.00000000000077,{"$error":"#N/A"},{"$error":"#N/A"},{"$error":"#N/A"},{"$error":"#N/A"},92.00000000000077,{"$error":"#N/A"},{"$error":"#N/A"},{"$error":"#N/A"}]
[{"$nulls":5},{"$error":"#N/A"},92.20000000000077,{"$error":"#N/A"},{"$error":"#N/A"},{"$error":"#N/A"},{"$error":"#N/A"},92.20000000000077,{"$error":"#N/A"},{"$error":"#N/A"},{"$error":"#N/A"},{"$error":"#N/A"},92.20000000000077,{"$error":"#N/A"},{"$error":"#N/A"},{"$error":"#N/A"}]
[{"$nulls":5},{"$error":"#N/A"},92.40000000000077,{"$error":"#N/A"},{"$error":"#N/A"},{"$error":"#N/A"},{"$error":"#N/A"},92.40000000000077,{"$error":"#N/A"},{"$error":"#N/A"},{"$error":"#N/A"},{"$error":"#N/A"},92.40000000000077,{"$error":"#N/A"},{"$error":"#N/A"},{"$error":"#N/A"}]
[{"$nulls":5},{"$error":"#N/A"},92.60000000000078,{"$error":"#N/A"},{"$error":"#N/A"},{"$error":"#N/A"},{"$error":"#N/A"},92.60000000000078,{"$error":"#N/A"},{"$error":"#N/A"},{"$error":"#N/A"},{"$error":"#N/A"},92.60000000000078,{"$error":"#N/A"},{"$error":"#N/A"},{"$error":"#N/A"}]
[{"$nulls":5},{"$error":"#N/A"},92.80000000000078,{"$error":"#N/A"},{"$error":"#N/A"},{"$error":"#N/A"},{"$error":"#N/A"},92.80000000000078,{"$error":"#N/A"},{"$error":"#N/A"},{"$error":"#N/A"},{"$error":"#N/A"},92.80000000000078,{"$error":"#N/A"},{"$error":"#N/A"},{"$error":"#N/A"}]
[{"$nulls":5},{"$error":"#N/A"},93.00000000000078,{"$error":"#N/A"},{"$error":"#N/A"},{"$error":"#N/A"},{"$error":"#N/A"},93.00000000000078,{"$error":"#N/A"},{"$error":"#N/A"},{"$error":"#N/A"},{"$error":"#N/A"},93.00000000000078,{"$error":"#N/A"},{"$error":"#N/A"},{"$error":"#N/A"}]
[{"$nulls":5},{"$error":"#N/A"},93.20000000000078,{"$error":"#N/A"},{"$error":"#N/A"},{"$error":"#N/A"},{"$error":"#N/A"},93.20000000000078,{"$error":"#N/A"},{"$error":"#N/A"},{"$error":"#N/A"},{"$error":"#N/A"},93.20000000000078,{"$error":"#N/A"},{"$error":"#N/A"},{"$error":"#N/A"}]
[{"$nulls":5},{"$error":"#N/A"},93.40000000000079,{"$error":"#N/A"},{"$error":"#N/A"},{"$error":"#N/A"},{"$error":"#N/A"},93.40000000000079,{"$error":"#N/A"},{"$error":"#N/A"},{"$error":"#N/A"},{"$error":"#N/A"},93.40000000000079,{"$error":"#N/A"},{"$error":"#N/A"},{"$error":"#N/A"}]
[{"$nulls":5},{"$error":"#N/A"},93.60000000000079,{"$error":"#N/A"},{"$error":"#N/A"},{"$error":"#N/A"},{"$error":"#N/A"},93.60000000000079,{"$error":"#N/A"},{"$error":"#N/A"},{"$error":"#N/A"},{"$error":"#N/A"},93.60000000000079,{"$error":"#N/A"},{"$error":"#N/A"},{"$error":"#N/A"}]
[{"$nulls":5},{"$error":"#N/A"},93.8000000000008,{"$error":"#N/A"},{"$error":"#N/A"},{"$error":"#N/A"},{"$error":"#N/A"},93.8000000000008,{"$error":"#N/A"},{"$error":"#N/A"},{"$error":"#N/A"},{"$error":"#N/A"},93.8000000000008,{"$error":"#N/A"},{"$error":"#N/A"},{"$error":"#N/A"}]
[{"$nulls":5},{"$error":"#N/A"},94.0000000000008,{"$error":"#N/A"},{"$error":"#N/A"},{"$error":"#N/A"},{"$error":"#N/A"},94.0000000000008,{"$error":"#N/A"},{"$error":"#N/A"},{"$error":"#N/A"},{"$error":"#N/A"},94.0000000000008,{"$error":"#N/A"},{"$error":"#N/A"},{"$error":"#N/A"}]
[{"$nulls":5},{"$error":"#N/A"},94.2000000000008,{"$error":"#N/A"},{"$error":"#N/A"},{"$error":"#N/A"},{"$error":"#N/A"},94.2000000000008,{"$error":"#N/A"},{"$error":"#N/A"},{"$error":"#N/A"},{"$error":"#N/A"},94.2000000000008,{"$error":"#N/A"},{"$error":"#N/A"},{"$error":"#N/A"}]
[{"$nulls":5},{"$error":"#N/A"},94.4000000000008,{"$error":"#N/A"},{"$error":"#N/A"},{"$error":"#N/A"},{"$error":"#N/A"},94.4000000000008,{"$error":"#N/A"},{"$error":"#N/A"},{"$error":"#N/A"},{"$error":"#N/A"},94.4000000000008,{"$error":"#N/A"},{"$error":"#N/A"},{"$error":"#N/A"}]
[{"$nulls":5},{"$error":"#N/A"},94.6000000000008,{"$error":"#N/A"},{"$error":"#N/A"},{"$error":"#N/A"},{"$error":"#N/A"},94.6000000000008,{"$error":"#N/A"},{"$error":"#N/A"},{"$error":"#N/A"},{"$error":"#N/A"},94.6000000000008,{"$error":"#N/A"},{"$error":"#N/A"},{"$error":"#N/A"}]
[{"$nulls":5},{"$error":"#N/A"},94.80000000000081,{"$error":"#N/A"},{"$error":"#N/A"},{"$error":"#N/A"},{"$error":"#N/A"},94.80000000000081,{"$error":"#N/A"},{"$error":"#N/A"},{"$error":"#N/A"},{"$error":"#N/A"},94.80000000000081,{"$error":"#N/A"},{"$error":"#N/A"},{"$error":"#N/A"}]
[{"$nulls":5},{"$error":"#N/A"},95.00000000000081,{"$error":"#N/A"},{"$error":"#N/A"},{"$error":"#N/A"},{"$error":"#N/A"},95.00000000000081,{"$error":"#N/A"},{"$error":"#N/A"},{"$error":"#N/A"},{"$error":"#N/A"},95.00000000000081,{"$error":"#N/A"},{"$error":"#N/A"},{"$error":"#N/A"}]
[{"$nulls":5},{"$error":"#N/A"},95.20000000000081,{"$error":"#N/A"},{"$error":"#N/A"},{"$error":"#N/A"},{"$error":"#N/A"},95.20000000000081,{"$error":"#N/A"},{"$error":"#N/A"},{"$error":"#N/A"},{"$error":"#N/A"},95.20000000000081,{"$error":"#N/A"},{"$error":"#N/A"},{"$error":"#N/A"}]
[{"$nulls":5},{"$error":"#N/A"},95.40000000000082,{"$error":"#N/A"},{"$error":"#N/A"},{"$error":"#N/A"},{"$error":"#N/A"},95.40000000000082,{"$error":"#N/A"},{"$error":"#N/A"},{"$error":"#N/A"},{"$error":"#N/A"},95.40000000000082,{"$error":"#N/A"},{"$error":"#N/A"},{"$error":"#N/A"}]
[{"$nulls":5},{"$error":"#N/A"},95.60000000000082,{"$error":"#N/A"},{"$error":"#N/A"},{"$error":"#N/A"},{"$error":"#N/A"},95.60000000000082,{"$error":"#N/A"},{"$error":"#N/A"},{"$error":"#N/A"},{"$error":"#N/A"},95.60000000000082,{"$error":"#N/A"},{"$error":"#N/A"},{"$error":"#N/A"}]
[{"$nulls":5},{"$error":"#N/A"},95.80000000000082,{"$error":"#N/A"},{"$error":"#N/A"},{"$error":"#N/A"},{"$error":"#N/A"},95.80000000000082,{"$error":"#N/A"},{"$error":"#N/A"},{"$error":"#N/A"},{"$error":"#N/A"},95.80000000000082,{"$error":"#N/A"},{"$error":"#N/A"},{"$error":"#N/A"}]
[{"$nulls":5},{"$error":"#N/A"},96.00000000000082,{"$error":"#N/A"},{"$error":"#N/A"},{"$error":"#N/A"},{"$error":"#N/A"},96.00000000000082,{"$error":"#N/A"},{"$error":"#N/A"},{"$error":"#N/A"},{"$error":"#N/A"},96.00000000000082,{"$error":"#N/A"},{"$error":"#N/A"},{"$error":"#N/A"}]
[{"$nulls":5},{"$error":"#N/A"},96.20000000000083,{"$error":"#N/A"},{"$error":"#N/A"},{"$error":"#N/A"},{"$error":"#N/A"},96.20000000000083,{"$error":"#N/A"},{"$error":"#N/A"},{"$error":"#N/A"},{"$error":"#N/A"},96.20000000000083,{"$error":"#N/A"},{"$error":"#N/A"},{"$error":"#N/A"}]
[{"$nulls":5},{"$error":"#N/A"},96.40000000000083,{"$error":"#N/A"},{"$error":"#N/A"},{"$error":"#N/A"},{"$error":"#N/A"},96.40000000000083,{"$error":"#N/A"},{"$error":"#N/A"},{"$error":"#N/A"},{"$error":"#N/A"},96.40000000000083,{"$error":"#N/A"},{"$error":"#N/A"},{"$error":"#N/A"}]
[{"$nulls":5},{"$error":"#N/A"},96.60000000000083,{"$error":"#N/A"},{"$error":"#N/A"},{"$error":"#N/A"},{"$error":"#N/A"},96.60000000000083,{"$error":"#N/A"},{"$error":"#N/A"},{"$error":"#N/A"},{"$error":"#N/A"},96.60000000000083,{"$error":"#N/A"},{"$error":"#N/A"},{"$error":"#N/A"}]
[{"$nulls":5},{"$error":"#N/A"},96.80000000000084,{"$error":"#N/A"},{"$error":"#N/A"},{"$error":"#N/A"},{"$error":"#N/A"},96.80000000000084,{"$error":"#N/A"},{"$error":"#N/A"},{"$error":"#N/A"},{"$error":"#N/A"},96.80000000000084,{"$error":"#N/A"},{"$error":"#N/A"},{"$error":"#N/A"}]
[{"$nulls":5},{"$error":"#N/A"},97.00000000000084,{"$error":"#N/A"},{"$error":"#N/A"},{"$error":"#N/A"},{"$error":"#N/A"},97.00000000000084,{"$error":"#N/A"},{"$error":"#N/A"},{"$error":"#N/A"},{"$error":"#N/A"},97.00000000000084,{"$error":"#N/A"},{"$error":"#N/A"},{"$error":"#N/A"}]
[{"$nulls":5},{"$error":"#N/A"},97.20000000000084,{"$error":"#N/A"},{"$error":"#N/A"},{"$error":"#N/A"},{"$error":"#N/A"},97.20000000000084,{"$error":"#N/A"},{"$error":"#N/A"},{"$error":"#N/A"},{"$error":"#N/A"},97.20000000000084,{"$error":"#N/A"},{"$error":"#N/A"},{"$error":"#N/A"}]
[{"$nulls":5},{"$error":"#N/A"},97.40000000000084,{"$error":"#N/A"},{"$error":"#N/A"},{"$error":"#N/A"},{"$error":"#N/A"},97.40000000000084,{"$error":"#N/A"},{"$error":"#N/A"},{"$error":"#N/A"},{"$error":"#N/A"},97.40000000000084,{"$error":"#N/A"},{"$error":"#N/A"},{"$error":"#N/A"}]
[{"$nulls":5},{"$error":"#N/A"},97.60000000000085,{"$error":"#N/A"},{"$error":"#N/A"},{"$error":"#N/A"},{"$error":"#N/A"},97.60000000000085,{"$error":"#N/A"},{"$error":"#N/A"},{"$error":"#N/A"},{"$error":"#N/A"},97.60000000000085,{"$error":"#N/A"},{"$error":"#N/A"},{"$error":"#N/A"}]
[{"$nulls":5},{"$error":"#N/A"},97.80000000000085,{"$error":"#N/A"},{"$error":"#N/A"},{"$error":"#N/A"},{"$error":"#N/A"},97.80000000000085,{"$error":"#N/A"},{"$error":"#N/A"},{"$error":"#N/A"},{"$error":"#N/A"},97.80000000000085,{"$error":"#N/A"},{"$error":"#N/A"},{"$error":"#N/A"}]
[{"$nulls":5},{"$error":"#N/A"},98.00000000000085,{"$error":"#N/A"},{"$error":"#N/A"},{"$error":"#N/A"},{"$error":"#N/A"},98.00000000000085,{"$error":"#N/A"},{"$error":"#N/A"},{"$error":"#N/A"},{"$error":"#N/A"},98.00000000000085,{"$error":"#N/A"},{"$error":"#N/A"},{"$error":"#N/A"}]
[{"$nulls":5},{"$error":"#N/A"},98.20000000000086,{"$error":"#N/A"},{"$error":"#N/A"},{"$error":"#N/A"},{"$error":"#N/A"},98.20000000000086,{"$error":"#N/A"},{"$error":"#N/A"},{"$error":"#N/A"},{"$error":"#N/A"},98.20000000000086,{"$error":"#N/A"},{"$error":"#N/A"},{"$error":"#N/A"}]
[{"$nulls":5},{"$error":"#N/A"},98.40000000000086,{"$error":"#N/A"},{"$error":"#N/A"},{"$error":"#N/A"},{"$error":"#N/A"},98.40000000000086,{"$error":"#N/A"},{"$error":"#N/A"},{"$error":"#N/A"},{"$error":"#N/A"},98.40000000000086,{"$error":"#N/A"},{"$error":"#N/A"},{"$error":"#N/A"}]
[{"$nulls":5},{"$error":"#N/A"},98.60000000000086,{"$error":"#N/A"},{"$error":"#N/A"},{"$error":"#N/A"},{"$error":"#N/A"},98.60000000000086,{"$error":"#N/A"},{"$error":"#N/A"},{"$error":"#N/A"},{"$error":"#N/A"},98.60000000000086,{"$error":"#N/A"},{"$error":"#N/A"},{"$error":"#N/A"}]
[{"$nulls":5},{"$error":"#N/A"},98.80000000000086,{"$error":"#N/A"},{"$error":"#N/A"},{"$error":"#N/A"},{"$error":"#N/A"},98.80000000000086,{"$error":"#N/A"},{"$error":"#N/A"},{"$error":"#N/A"},{"$error":"#N/A"},98.80000000000086,{"$error":"#N/A"},{"$error":"#N/A"},{"$error":"#N/A"}]
[{"$nulls":5},{"$error":"#N/A"},99.00000000000087,{"$error":"#N/A"},{"$error":"#N/A"},{"$error":"#N/A"},{"$error":"#N/A"},99.00000000000087,{"$error":"#N/A"},{"$error":"#N/A"},{"$error":"#N/A"},{"$error":"#N/A"},99.00000000000087,{"$error":"#N/A"},{"$error":"#N/A"},{"$error":"#N/A"}]
[{"$nulls":5},{"$error":"#N/A"},99.20000000000087,{"$error":"#N/A"},{"$error":"#N/A"},{"$error":"#N/A"},{"$error":"#N/A"},99.20000000000087,{"$error":"#N/A"},{"$error":"#N/A"},{"$error":"#N/A"},{"$error":"#N/A"},99.20000000000087,{"$error":"#N/A"},{"$error":"#N/A"},{"$error":"#N/A"}]
[{"$nulls":5},{"$f":"IF(F499<$I$2,F499+30,NA())","v":{"$error":"#N/A"}},{"$f":"G499+$G$2","v":99.40000000000087},{"$f":"-1+COS(F500*PI()/180)+G500","v":{"$error":"#N/A"}},{"$f":"(F500/$I$2)*($D$8-$D$7)+COS(F500*PI()/180)+$D$7-1","v":{"$error":"#N/A"}},{"$f":"$J$2*SIN(F500*PI()/180)+$B$18","v":{"$error":"#N/A"}},{"$error":"#N/A"},99.40000000000087,{"$f":"-1+COS(K500*PI()/180)+L500","v":{"$error":"#N/A"}},{"$f":"(K500/$N$2)*($D$13-$D$12)+COS(K500*PI()/180)+$D$12-1","v":{"$error":"#N/A"}},{"$f":"$O$2*SIN(K500*PI()/180)+$B$19","v":{"$error":"#N/A"}},{"$error":"#N/A"},{"$f":"Q499+$G$2","v":99.40000000000087},{"$f":"-1+COS(P500*PI()/180)+Q500","v":{"$error":"#N/A"}},{"$f":"(P500/$S$2)*($D$18-$D$17)+COS(P500*PI()/180)+$D$17-1","v":{"$error":"#N/A"}},{"$f":"$T$2*SIN(P500*PI()/180)+$B$20","v":{"$error":"#N/A"}}]
[{"$nulls":5},{"$error":"#N/A"},99.60000000000088,{"$error":"#N/A"},{"$error":"#N/A"},{"$error":"#N/A"},{"$error":"#N/A"},99.60000000000088,{"$error":"#N/A"},{"$error":"#N/A"},{"$error":"#N/A"},{"$error":"#N/A"},99.60000000000088,{"$error":"#N/A"},{"$error":"#N/A"},{"$error":"#N/A"}]
[{"$nulls":5},{"$error":"#N/A"},99.80000000000088,{"$error":"#N/A"},{"$error":"#N/A"},{"$error":"#N/A"},{"$error":"#N/A"},99.80000000000088,{"$error":"#N/A"},{"$error":"#N/A"},{"$error":"#N/A"},{"$error":"#N/A"},99.80000000000088,{"$error":"#N/A"},{"$error":"#N/A"},{"$error":"#N/A"}]
[{"$nulls":5},{"$error":"#N/A"},100.00000000000088,{"$error":"#N/A"},{"$error":"#N/A"},{"$error":"#N/A"},{"$error":"#N/A"},100.00000000000088,{"$error":"#N/A"},{"$error":"#N/A"},{"$error":"#N/A"},{"$error":"#N/A"},100.00000000000088,{"$error":"#N/A"},{"$error":"#N/A"},{"$error":"#N/A"}]
[{"$nulls":5},{"$error":"#N/A"},100.20000000000088,{"$error":"#N/A"},{"$error":"#N/A"},{"$error":"#N/A"},{"$error":"#N/A"},100.20000000000088,{"$error":"#N/A"},{"$error":"#N/A"},{"$error":"#N/A"},{"$error":"#N/A"},100.20000000000088,{"$error":"#N/A"},{"$error":"#N/A"},{"$error":"#N/A"}]
[{"$nulls":5},{"$error":"#N/A"},100.40000000000089,{"$error":"#N/A"},{"$error":"#N/A"},{"$error":"#N/A"},{"$error":"#N/A"},100.40000000000089,{"$error":"#N/A"},{"$error":"#N/A"},{"$error":"#N/A"},{"$error":"#N/A"},100.40000000000089,{"$error":"#N/A"},{"$error":"#N/A"},{"$error":"#N/A"}]
[{"$nulls":5},{"$error":"#N/A"},100.60000000000089,{"$error":"#N/A"},{"$error":"#N/A"},{"$error":"#N/A"},{"$error":"#N/A"},100.60000000000089,{"$error":"#N/A"},{"$error":"#N/A"},{"$error":"#N/A"},{"$error":"#N/A"},100.60000000000089,{"$error":"#N/A"},{"$error":"#N/A"},{"$error":"#N/A"}]
[{"$nulls":5},{"$error":"#N/A"},100.80000000000089,{"$error":"#N/A"},{"$error":"#N/A"},{"$error":"#N/A"},{"$error":"#N/A"},100.80000000000089,{"$error":"#N/A"},{"$error":"#N/A"},{"$error":"#N/A"},{"$error":"#N/A"},100.80000000000089,{"$error":"#N/A"},{"$error":"#N/A"},{"$error":"#N/A"}]
[{"$nulls":5},{"$error":"#N/A"},101.0000000000009,{"$error":"#N/A"},{"$error":"#N/A"},{"$error":"#N/A"},{"$error":"#N/A"},101.0000000000009,{"$error":"#N/A"},{"$error":"#N/A"},{"$error":"#N/A"},{"$error":"#N/A"},101.0000000000009,{"$error":"#N/A"},{"$error":"#N/A"},{"$error":"#N/A"}]
[{"$nulls":5},{"$error":"#N/A"},101.2000000000009,{"$error":"#N/A"},{"$error":"#N/A"},{"$error":"#N/A"},{"$error":"#N/A"},101.2000000000009,{"$error":"#N/A"},{"$error":"#N/A"},{"$error":"#N/A"},{"$error":"#N/A"},101.2000000000009,{"$error":"#N/A"},{"$error":"#N/A"},{"$error":"#N/A"}]
[{"$nulls":5},{"$error":"#N/A"},101.4000000000009,{"$error":"#N/A"},{"$error":"#N/A"},{"$error":"#N/A"},{"$error":"#N/A"},101.4000000000009,{"$error":"#N/A"},{"$error":"#N/A"},{"$error":"#N/A"},{"$error":"#N/A"},101.4000000000009,{"$error":"#N/A"},{"$error":"#N/A"},{"$error":"#N/A"}]
[{"$nulls":5},{"$error":"#N/A"},101.6000000000009,{"$error":"#N/A"},{"$error":"#N/A"},{"$error":"#N/A"},{"$error":"#N/A"},101.6000000000009,{"$error":"#N/A"},{"$error":"#N/A"},{"$error":"#N/A"},{"$error":"#N/A"},101.6000000000009,{"$error":"#N/A"},{"$error":"#N/A"},{"$error":"#N/A"}]
[{"$nulls":5},{"$error":"#N/A"},101.8000000000009,{"$error":"#N/A"},{"$error":"#N/A"},{"$error":"#N/A"},{"$error":"#N/A"},101.8000000000009,{"$error":"#N/A"},{"$error":"#N/A"},{"$error":"#N/A"},{"$error":"#N/A"},101.8000000000009,{"$error":"#N/A"},{"$error":"#N/A"},{"$error":"#N/A"}]
[{"$nulls":5},{"$error":"#N/A"},102.00000000000091,{"$error":"#N/A"},{"$error":"#N/A"},{"$error":"#N/A"},{"$error":"#N/A"},102.00000000000091,{"$error":"#N/A"},{"$error":"#N/A"},{"$error":"#N/A"},{"$error":"#N/A"},102.00000000000091,{"$error":"#N/A"},{"$error":"#N/A"},{"$error":"#N/A"}]
[{"$nulls":5},{"$error":"#N/A"},102.20000000000091,{"$error":"#N/A"},{"$error":"#N/A"},{"$error":"#N/A"},{"$error":"#N/A"},102.20000000000091,{"$error":"#N/A"},{"$error":"#N/A"},{"$error":"#N/A"},{"$error":"#N/A"},102.20000000000091,{"$error":"#N/A"},{"$error":"#N/A"},{"$error":"#N/A"}]
[{"$nulls":5},{"$error":"#N/A"},102.40000000000092,{"$error":"#N/A"},{"$error":"#N/A"},{"$error":"#N/A"},{"$error":"#N/A"},102.40000000000092,{"$error":"#N/A"},{"$error":"#N/A"},{"$error":"#N/A"},{"$error":"#N/A"},102.40000000000092,{"$error":"#N/A"},{"$error":"#N/A"},{"$error":"#N/A"}]
[{"$nulls":5},{"$error":"#N/A"},102.60000000000092,{"$error":"#N/A"},{"$error":"#N/A"},{"$error":"#N/A"},{"$error":"#N/A"},102.60000000000092,{"$error":"#N/A"},{"$error":"#N/A"},{"$error":"#N/A"},{"$error":"#N/A"},102.60000000000092,{"$error":"#N/A"},{"$error":"#N/A"},{"$error":"#N/A"}]
[{"$nulls":5},{"$error":"#N/A"},102.80000000000092,{"$error":"#N/A"},{"$error":"#N/A"},{"$error":"#N/A"},{"$f":"IF(K516<$N$2,K516+30,NA())","v":{"$error":"#N/A"}},{"$f":"L516+$L$2","v":102.80000000000092},{"$error":"#N/A"},{"$error":"#N/A"},{"$error":"#N/A"},{"$f":"IF(P516<$S$2,P516+30,NA())","v":{"$error":"#N/A"}},102.80000000000092,{"$error":"#N/A"},{"$error":"#N/A"},{"$error":"#N/A"}]
[{"$nulls":5},{"$error":"#N/A"},103.00000000000092,{"$error":"#N/A"},{"$error":"#N/A"},{"$error":"#N/A"},{"$error":"#N/A"},103.00000000000092,{"$error":"#N/A"},{"$error":"#N/A"},{"$error":"#N/A"},{"$error":"#N/A"},103.00000000000092,{"$error":"#N/A"},{"$error":"#N/A"},{"$error":"#N/A"}]
[{"$nulls":5},{"$error":"#N/A"},103.20000000000093,{"$error":"#N/A"},{"$error":"#N/A"},{"$error":"#N/A"},{"$error":"#N/A"},103.20000000000093,{"$error":"#N/A"},{"$error":"#N/A"},{"$error":"#N/A"},{"$error":"#N/A"},103.20000000000093,{"$error":"#N/A"},{"$error":"#N/A"},{"$error":"#N/A"}]
[{"$nulls":5},{"$error":"#N/A"},103.40000000000093,{"$error":"#N/A"},{"$error":"#N/A"},{"$error":"#N/A"},{"$error":"#N/A"},103.40000000000093,{"$error":"#N/A"},{"$error":"#N/A"},{"$error":"#N/A"},{"$error":"#N/A"},103.40000000000093,{"$error":"#N/A"},{"$error":"#N/A"},{"$error":"#N/A"}]
[{"$nulls":5},{"$error":"#N/A"},103.60000000000093,{"$error":"#N/A"},{"$error":"#N/A"},{"$error":"#N/A"},{"$error":"#N/A"},103.60000000000093,{"$error":"#N/A"},{"$error":"#N/A"},{"$error":"#N/A"},{"$error":"#N/A"},103.60000000000093,{"$error":"#N/A"},{"$error":"#N/A"},{"$error":"#N/A"}]
[{"$nulls":5},{"$error":"#N/A"},103.80000000000094,{"$error":"#N/A"},{"$error":"#N/A"},{"$error":"#N/A"},{"$error":"#N/A"},103.80000000000094,{"$error":"#N/A"},{"$error":"#N/A"},{"$error":"#N/A"},{"$error":"#N/A"},103.80000000000094,{"$error":"#N/A"},{"$error":"#N/A"},{"$error":"#N/A"}]
[{"$nulls":5},{"$error":"#N/A"},104.00000000000094,{"$error":"#N/A"},{"$error":"#N/A"},{"$error":"#N/A"},{"$error":"#N/A"},104.00000000000094,{"$error":"#N/A"},{"$error":"#N/A"},{"$error":"#N/A"},{"$error":"#N/A"},104.00000000000094,{"$error":"#N/A"},{"$error":"#N/A"},{"$error":"#N/A"}]
[{"$nulls":5},{"$error":"#N/A"},104.20000000000094,{"$error":"#N/A"},{"$error":"#N/A"},{"$error":"#N/A"},{"$error":"#N/A"},104.20000000000094,{"$error":"#N/A"},{"$error":"#N/A"},{"$error":"#N/A"},{"$error":"#N/A"},104.20000000000094,{"$error":"#N/A"},{"$error":"#N/A"},{"$error":"#N/A"}]
[{"$nulls":5},{"$error":"#N/A"},104.40000000000094,{"$error":"#N/A"},{"$error":"#N/A"},{"$error":"#N/A"},{"$error":"#N/A"},104.40000000000094,{"$error":"#N/A"},{"$error":"#N/A"},{"$error":"#N/A"},{"$error":"#N/A"},104.40000000000094,{"$error":"#N/A"},{"$error":"#N/A"},{"$error":"#N/A"}]
[{"$nulls":5},{"$error":"#N/A"},104.60000000000095,{"$error":"#N/A"},{"$error":"#N/A"},{"$error":"#N/A"},{"$error":"#N/A"},104.60000000000095,{"$error":"#N/A"},{"$error":"#N/A"},{"$error":"#N/A"},{"$error":"#N/A"},104.60000000000095,{"$error":"#N/A"},{"$error":"#N/A"},{"$error":"#N/A"}]
[{"$nulls":5},{"$error":"#N/A"},104.80000000000095,{"$error":"#N/A"},{"$error":"#N/A"},{"$error":"#N/A"},{"$error":"#N/A"},104.80000000000095,{"$error":"#N/A"},{"$error":"#N/A"},{"$error":"#N/A"},{"$error":"#N/A"},104.80000000000095,{"$error":"#N/A"},{"$error":"#N/A"},{"$error":"#N/A"}]
[{"$nulls":5},{"$error":"#N/A"},105.00000000000095,{"$error":"#N/A"},{"$error":"#N/A"},{"$error":"#N/A"},{"$error":"#N/A"},105.00000000000095,{"$error":"#N/A"},{"$error":"#N/A"},{"$error":"#N/A"},{"$error":"#N/A"},105.00000000000095,{"$error":"#N/A"},{"$error":"#N/A"},{"$error":"#N/A"}]
[{"$nulls":5},{"$error":"#N/A"},105.20000000000095,{"$error":"#N/A"},{"$error":"#N/A"},{"$error":"#N/A"},{"$error":"#N/A"},105.20000000000095,{"$error":"#N/A"},{"$error":"#N/A"},{"$error":"#N/A"},{"$error":"#N/A"},105.20000000000095,{"$error":"#N/A"},{"$error":"#N/A"},{"$error":"#N/A"}]
[{"$nulls":5},{"$error":"#N/A"},105.40000000000096,{"$error":"#N/A"},{"$error":"#N/A"},{"$error":"#N/A"},{"$error":"#N/A"},105.40000000000096,{"$error":"#N/A"},{"$error":"#N/A"},{"$error":"#N/A"},{"$error":"#N/A"},105.40000000000096,{"$error":"#N/A"},{"$error":"#N/A"},{"$error":"#N/A"}]
[{"$nulls":5},{"$error":"#N/A"},105.60000000000096,{"$error":"#N/A"},{"$error":"#N/A"},{"$error":"#N/A"},{"$error":"#N/A"},105.60000000000096,{"$error":"#N/A"},{"$error":"#N/A"},{"$error":"#N/A"},{"$error":"#N/A"},105.60000000000096,{"$error":"#N/A"},{"$error":"#N/A"},{"$error":"#N/A"}]
[{"$nulls":5},{"$error":"#N/A"},105.80000000000096,{"$error":"#N/A"},{"$error":"#N/A"},{"$error":"#N/A"},{"$error":"#N/A"},105.80000000000096,{"$error":"#N/A"},{"$error":"#N/A"},{"$error":"#N/A"},{"$error":"#N/A"},105.80000000000096,{"$error":"#N/A"},{"$error":"#N/A"},{"$error":"#N/A"}]
[{"$nulls":5},{"$error":"#N/A"},106.00000000000097,{"$error":"#N/A"},{"$error":"#N/A"},{"$error":"#N/A"},{"$error":"#N/A"},106.00000000000097,{"$error":"#N/A"},{"$error":"#N/A"},{"$error":"#N/A"},{"$error":"#N/A"},106.00000000000097,{"$error":"#N/A"},{"$error":"#N/A"},{"$error":"#N/A"}]
[{"$nulls":5},{"$error":"#N/A"},106.20000000000097,{"$error":"#N/A"},{"$error":"#N/A"},{"$error":"#N/A"},{"$error":"#N/A"},106.20000000000097,{"$error":"#N/A"},{"$error":"#N/A"},{"$error":"#N/A"},{"$error":"#N/A"},106.20000000000097,{"$error":"#N/A"},{"$error":"#N/A"},{"$error":"#N/A"}]
[{"$nulls":5},{"$error":"#N/A"},106.40000000000097,{"$error":"#N/A"},{"$error":"#N/A"},{"$error":"#N/A"},{"$error":"#N/A"},106.40000000000097,{"$error":"#N/A"},{"$error":"#N/A"},{"$error":"#N/A"},{"$error":"#N/A"},106.40000000000097,{"$error":"#N/A"},{"$error":"#N/A"},{"$error":"#N/A"}]
[{"$nulls":5},{"$error":"#N/A"},106.60000000000097,{"$error":"#N/A"},{"$error":"#N/A"},{"$error":"#N/A"},{"$error":"#N/A"},106.60000000000097,{"$error":"#N/A"},{"$error":"#N/A"},{"$error":"#N/A"},{"$error":"#N/A"},106.60000000000097,{"$error":"#N/A"},{"$error":"#N/A"},{"$error":"#N/A"}]
[{"$nulls":5},{"$error":"#N/A"},106.80000000000098,{"$error":"#N/A"},{"$error":"#N/A"},{"$error":"#N/A"},{"$error":"#N/A"},106.80000000000098,{"$error":"#N/A"},{"$error":"#N/A"},{"$error":"#N/A"},{"$error":"#N/A"},106.80000000000098,{"$error":"#N/A"},{"$error":"#N/A"},{"$error":"#N/A"}]
[{"$nulls":5},{"$error":"#N/A"},107.00000000000098,{"$error":"#N/A"},{"$error":"#N/A"},{"$error":"#N/A"},{"$error":"#N/A"},107.00000000000098,{"$error":"#N/A"},{"$error":"#N/A"},{"$error":"#N/A"},{"$error":"#N/A"},107.00000000000098,{"$error":"#N/A"},{"$error":"#N/A"},{"$error":"#N/A"}]
[{"$nulls":5},{"$error":"#N/A"},107.20000000000098,{"$error":"#N/A"},{"$error":"#N/A"},{"$error":"#N/A"},{"$error":"#N/A"},107.20000000000098,{"$error":"#N/A"},{"$error":"#N/A"},{"$error":"#N/A"},{"$error":"#N/A"},107.20000000000098,{"$error":"#N/A"},{"$error":"#N/A"},{"$error":"#N/A"}]
[{"$nulls":5},{"$error":"#N/A"},107.40000000000099,{"$error":"#N/A"},{"$error":"#N/A"},{"$error":"#N/A"},{"$error":"#N/A"},107.40000000000099,{"$error":"#N/A"},{"$error":"#N/A"},{"$error":"#N/A"},{"$error":"#N/A"},107.40000000000099,{"$error":"#N/A"},{"$error":"#N/A"},{"$error":"#N/A"}]
[{"$nulls":5},{"$error":"#N/A"},107.60000000000099,{"$error":"#N/A"},{"$error":"#N/A"},{"$error":"#N/A"},{"$error":"#N/A"},107.60000000000099,{"$error":"#N/A"},{"$error":"#N/A"},{"$error":"#N/A"},{"$error":"#N/A"},107.60000000000099,{"$error":"#N/A"},{"$error":"#N/A"},{"$error":"#N/A"}]
[{"$nulls":5},{"$error":"#N/A"},107.80000000000099,{"$error":"#N/A"},{"$error":"#N/A"},{"$error":"#N/A"},{"$error":"#N/A"},107.80000000000099,{"$error":"#N/A"},{"$error":"#N/A"},{"$error":"#N/A"},{"$error":"#N/A"},107.80000000000099,{"$error":"#N/A"},{"$error":"#N/A"},{"$error":"#N/A"}]
[{"$nulls":5},{"$error":"#N/A"},108.000000000001,{"$error":"#N/A"},{"$error":"#N/A"},{"$error":"#N/A"},{"$error":"#N/A"},108.000000000001,{"$error":"#N/A"},{"$error":"#N/A"},{"$error":"#N/A"},{"$error":"#N/A"},108.000000000001,{"$error":"#N/A"},{"$error":"#N/A"},{"$error":"#N/A"}]
[{"$nulls":5},{"$error":"#N/A"},108.200000000001,{"$error":"#N/A"},{"$error":"#N/A"},{"$error":"#N/A"},{"$error":"#N/A"},108.200000000001,{"$error":"#N/A"},{"$error":"#N/A"},{"$error":"#N/A"},{"$error":"#N/A"},108.200000000001,{"$error":"#N/A"},{"$error":"#N/A"},{"$error":"#N/A"}]
[{"$nulls":5},{"$error":"#N/A"},108.400000000001,{"$error":"#N/A"},{"$error":"#N/A"},{"$error":"#N/A"},{"$error":"#N/A"},108.400000000001,{"$error":"#N/A"},{"$error":"#N/A"},{"$error":"#N/A"},{"$error":"#N/A"},108.400000000001,{"$error":"#N/A"},{"$error":"#N/A"},{"$error":"#N/A"}]
[{"$nulls":5},{"$error":"#N/A"},108.600000000001,{"$error":"#N/A"},{"$error":"#N/A"},{"$error":"#N/A"},{"$error":"#N/A"},108.600000000001,{"$error":"#N/A"},{"$error":"#N/A"},{"$error":"#N/A"},{"$error":"#N/A"},108.600000000001,{"$error":"#N/A"},{"$error":"#N/A"},{"$error":"#N/A"}]
[{"$nulls":5},{"$error":"#N/A"},108.800000000001,{"$error":"#N/A"},{"$error":"#N/A"},{"$error":"#N/A"},{"$error":"#N/A"},108.800000000001,{"$error":"#N/A"},{"$error":"#N/A"},{"$error":"#N/A"},{"$error":"#N/A"},108.800000000001,{"$error":"#N/A"},{"$error":"#N/A"},{"$error":"#N/A"}]
[{"$nulls":5},{"$error":"#N/A"},109.00000000000101,{"$error":"#N/A"},{"$error":"#N/A"},{"$error":"#N/A"},{"$error":"#N/A"},109.00000000000101,{"$error":"#N/A"},{"$error":"#N/A"},{"$error":"#N/A"},{"$error":"#N/A"},109.00000000000101,{"$error":"#N/A"},{"$error":"#N/A"},{"$error":"#N/A"}]
[{"$nulls":5},{"$error":"#N/A"},109.20000000000101,{"$error":"#N/A"},{"$error":"#N/A"},{"$error":"#N/A"},{"$error":"#N/A"},109.20000000000101,{"$error":"#N/A"},{"$error":"#N/A"},{"$error":"#N/A"},{"$error":"#N/A"},109.20000000000101,{"$error":"#N/A"},{"$error":"#N/A"},{"$error":"#N/A"}]
[{"$nulls":5},{"$error":"#N/A"},109.40000000000101,{"$error":"#N/A"},{"$error":"#N/A"},{"$error":"#N/A"},{"$error":"#N/A"},109.40000000000101,{"$error":"#N/A"},{"$error":"#N/A"},{"$error":"#N/A"},{"$error":"#N/A"},109.40000000000101,{"$error":"#N/A"},{"$error":"#N/A"},{"$error":"#N/A"}]
[{"$nulls":5},{"$error":"#N/A"},109.60000000000102,{"$error":"#N/A"},{"$error":"#N/A"},{"$error":"#N/A"},{"$error":"#N/A"},109.60000000000102,{"$error":"#N/A"},{"$error":"#N/A"},{"$error":"#N/A"},{"$error":"#N/A"},109.60000000000102,{"$error":"#N/A"},{"$error":"#N/A"},{"$error":"#N/A"}]
[{"$nulls":5},{"$error":"#N/A"},109.80000000000102,{"$error":"#N/A"},{"$error":"#N/A"},{"$error":"#N/A"},{"$error":"#N/A"},109.80000000000102,{"$error":"#N/A"},{"$error":"#N/A"},{"$error":"#N/A"},{"$error":"#N/A"},109.80000000000102,{"$error":"#N/A"},{"$error":"#N/A"},{"$error":"#N/A"}]
[{"$nulls":5},{"$error":"#N/A"},110.00000000000102,{"$error":"#N/A"},{"$error":"#N/A"},{"$error":"#N/A"},{"$error":"#N/A"},110.00000000000102,{"$error":"#N/A"},{"$error":"#N/A"},{"$error":"#N/A"},{"$error":"#N/A"},110.00000000000102,{"$error":"#N/A"},{"$error":"#N/A"},{"$error":"#N/A"}]
[{"$nulls":5},{"$error":"#N/A"},110.20000000000103,{"$error":"#N/A"},{"$error":"#N/A"},{"$error":"#N/A"},{"$error":"#N/A"},110.20000000000103,{"$error":"#N/A"},{"$error":"#N/A"},{"$error":"#N/A"},{"$error":"#N/A"},110.20000000000103,{"$error":"#N/A"},{"$error":"#N/A"},{"$error":"#N/A"}]
[{"$nulls":5},{"$error":"#N/A"},110.40000000000103,{"$error":"#N/A"},{"$error":"#N/A"},{"$error":"#N/A"},{"$error":"#N/A"},110.40000000000103,{"$error":"#N/A"},{"$error":"#N/A"},{"$error":"#N/A"},{"$error":"#N/A"},110.40000000000103,{"$error":"#N/A"},{"$error":"#N/A"},{"$error":"#N/A"}]
[{"$nulls":5},{"$error":"#N/A"},110.60000000000103,{"$error":"#N/A"},{"$error":"#N/A"},{"$error":"#N/A"},{"$error":"#N/A"},110.60000000000103,{"$error":"#N/A"},{"$error":"#N/A"},{"$error":"#N/A"},{"$error":"#N/A"},110.60000000000103,{"$error":"#N/A"},{"$error":"#N/A"},{"$error":"#N/A"}]
[{"$nulls":5},{"$error":"#N/A"},110.80000000000103,{"$error":"#N/A"},{"$error":"#N/A"},{"$error":"#N/A"},{"$error":"#N/A"},110.80000000000103,{"$error":"#N/A"},{"$error":"#N/A"},{"$error":"#N/A"},{"$error":"#N/A"},110.80000000000103,{"$error":"#N/A"},{"$error":"#N/A"},{"$error":"#N/A"}]
[{"$nulls":5},{"$error":"#N/A"},111.00000000000104,{"$error":"#N/A"},{"$error":"#N/A"},{"$error":"#N/A"},{"$error":"#N/A"},111.00000000000104,{"$error":"#N/A"},{"$error":"#N/A"},{"$error":"#N/A"},{"$error":"#N/A"},111.00000000000104,{"$error":"#N/A"},{"$error":"#N/A"},{"$error":"#N/A"}]
[{"$nulls":5},{"$error":"#N/A"},111.20000000000104,{"$error":"#N/A"},{"$error":"#N/A"},{"$error":"#N/A"},{"$error":"#N/A"},111.20000000000104,{"$error":"#N/A"},{"$error":"#N/A"},{"$error":"#N/A"},{"$error":"#N/A"},111.20000000000104,{"$error":"#N/A"},{"$error":"#N/A"},{"$error":"#N/A"}]
[{"$nulls":5},{"$error":"#N/A"},111.40000000000104,{"$error":"#N/A"},{"$error":"#N/A"},{"$error":"#N/A"},{"$error":"#N/A"},111.40000000000104,{"$error":"#N/A"},{"$error":"#N/A"},{"$error":"#N/A"},{"$error":"#N/A"},111.40000000000104,{"$error":"#N/A"},{"$error":"#N/A"},{"$error":"#N/A"}]
[{"$nulls":5},{"$error":"#N/A"},111.60000000000105,{"$error":"#N/A"},{"$error":"#N/A"},{"$error":"#N/A"},{"$error":"#N/A"},111.60000000000105,{"$error":"#N/A"},{"$error":"#N/A"},{"$error":"#N/A"},{"$error":"#N/A"},111.60000000000105,{"$error":"#N/A"},{"$error":"#N/A"},{"$error":"#N/A"}]
[{"$nulls":5},{"$error":"#N/A"},111.80000000000105,{"$error":"#N/A"},{"$error":"#N/A"},{"$error":"#N/A"},{"$error":"#N/A"},111.80000000000105,{"$error":"#N/A"},{"$error":"#N/A"},{"$error":"#N/A"},{"$error":"#N/A"},111.80000000000105,{"$error":"#N/A"},{"$error":"#N/A"},{"$error":"#N/A"}]
[{"$nulls":5},{"$error":"#N/A"},112.00000000000105,{"$error":"#N/A"},{"$error":"#N/A"},{"$error":"#N/A"},{"$error":"#N/A"},112.00000000000105,{"$error":"#N/A"},{"$error":"#N/A"},{"$error":"#N/A"},{"$error":"#N/A"},112.00000000000105,{"$error":"#N/A"},{"$error":"#N/A"},{"$error":"#N/A"}]
[{"$nulls":5},{"$f":"IF(F563<$I$2,F563+30,NA())","v":{"$error":"#N/A"}},{"$f":"G563+$G$2","v":112.20000000000105},{"$f":"-1+COS(F564*PI()/180)+G564","v":{"$error":"#N/A"}},{"$f":"(F564/$I$2)*($D$8-$D$7)+COS(F564*PI()/180)+$D$7-1","v":{"$error":"#N/A"}},{"$f":"$J$2*SIN(F564*PI()/180)+$B$18","v":{"$error":"#N/A"}},{"$error":"#N/A"},112.20000000000105,{"$f":"-1+COS(K564*PI()/180)+L564","v":{"$error":"#N/A"}},{"$f":"(K564/$N$2)*($D$13-$D$12)+COS(K564*PI()/180)+$D$12-1","v":{"$error":"#N/A"}},{"$f":"$O$2*SIN(K564*PI()/180)+$B$19","v":{"$error":"#N/A"}},{"$error":"#N/A"},{"$f":"Q563+$G$2","v":112.20000000000105},{"$f":"-1+COS(P564*PI()/180)+Q564","v":{"$error":"#N/A"}},{"$f":"(P564/$S$2)*($D$18-$D$17)+COS(P564*PI()/180)+$D$17-1","v":{"$error":"#N/A"}},{"$f":"$T$2*SIN(P564*PI()/180)+$B$20","v":{"$error":"#N/A"}}]
[{"$nulls":5},{"$error":"#N/A"},112.40000000000106,{"$error":"#N/A"},{"$error":"#N/A"},{"$error":"#N/A"},{"$error":"#N/A"},112.40000000000106,{"$error":"#N/A"},{"$error":"#N/A"},{"$error":"#N/A"},{"$error":"#N/A"},112.40000000000106,{"$error":"#N/A"},{"$error":"#N/A"},{"$error":"#N/A"}]
[{"$nulls":5},{"$error":"#N/A"},112.60000000000106,{"$error":"#N/A"},{"$error":"#N/A"},{"$error":"#N/A"},{"$error":"#N/A"},112.60000000000106,{"$error":"#N/A"},{"$error":"#N/A"},{"$error":"#N/A"},{"$error":"#N/A"},112.60000000000106,{"$error":"#N/A"},{"$error":"#N/A"},{"$error":"#N/A"}]
[{"$nulls":5},{"$error":"#N/A"},112.80000000000106,{"$error":"#N/A"},{"$error":"#N/A"},{"$error":"#N/A"},{"$error":"#N/A"},112.80000000000106,{"$error":"#N/A"},{"$error":"#N/A"},{"$error":"#N/A"},{"$error":"#N/A"},112.80000000000106,{"$error":"#N/A"},{"$error":"#N/A"},{"$error":"#N/A"}]
[{"$nulls":5},{"$error":"#N/A"},113.00000000000107,{"$error":"#N/A"},{"$error":"#N/A"},{"$error":"#N/A"},{"$error":"#N/A"},113.00000000000107,{"$error":"#N/A"},{"$error":"#N/A"},{"$error":"#N/A"},{"$error":"#N/A"},113.00000000000107,{"$error":"#N/A"},{"$error":"#N/A"},{"$error":"#N/A"}]
[{"$nulls":5},{"$error":"#N/A"},113.20000000000107,{"$error":"#N/A"},{"$error":"#N/A"},{"$error":"#N/A"},{"$error":"#N/A"},113.20000000000107,{"$error":"#N/A"},{"$error":"#N/A"},{"$error":"#N/A"},{"$error":"#N/A"},113.20000000000107,{"$error":"#N/A"},{"$error":"#N/A"},{"$error":"#N/A"}]
[{"$nulls":5},{"$error":"#N/A"},113.40000000000107,{"$error":"#N/A"},{"$error":"#N/A"},{"$error":"#N/A"},{"$error":"#N/A"},113.40000000000107,{"$error":"#N/A"},{"$error":"#N/A"},{"$error":"#N/A"},{"$error":"#N/A"},113.40000000000107,{"$error":"#N/A"},{"$error":"#N/A"},{"$error":"#N/A"}]
[{"$nulls":5},{"$error":"#N/A"},113.60000000000107,{"$error":"#N/A"},{"$error":"#N/A"},{"$error":"#N/A"},{"$error":"#N/A"},113.60000000000107,{"$error":"#N/A"},{"$error":"#N/A"},{"$error":"#N/A"},{"$error":"#N/A"},113.60000000000107,{"$error":"#N/A"},{"$error":"#N/A"},{"$error":"#N/A"}]
[{"$nulls":5},{"$error":"#N/A"},113.80000000000108,{"$error":"#N/A"},{"$error":"#N/A"},{"$error":"#N/A"},{"$error":"#N/A"},113.80000000000108,{"$error":"#N/A"},{"$error":"#N/A"},{"$error":"#N/A"},{"$error":"#N/A"},113.80000000000108,{"$error":"#N/A"},{"$error":"#N/A"},{"$error":"#N/A"}]
[{"$nulls":5},{"$error":"#N/A"},114.00000000000108,{"$error":"#N/A"},{"$error":"#N/A"},{"$error":"#N/A"},{"$error":"#N/A"},114.00000000000108,{"$error":"#N/A"},{"$error":"#N/A"},{"$error":"#N/A"},{"$error":"#N/A"},114.00000000000108,{"$error":"#N/A"},{"$error":"#N/A"},{"$error":"#N/A"}]
[{"$nulls":5},{"$error":"#N/A"},114.20000000000108,{"$error":"#N/A"},{"$error":"#N/A"},{"$error":"#N/A"},{"$error":"#N/A"},114.20000000000108,{"$error":"#N/A"},{"$error":"#N/A"},{"$error":"#N/A"},{"$error":"#N/A"},114.20000000000108,{"$error":"#N/A"},{"$error":"#N/A"},{"$error":"#N/A"}]
[{"$nulls":5},{"$error":"#N/A"},114.40000000000109,{"$error":"#N/A"},{"$error":"#N/A"},{"$error":"#N/A"},{"$error":"#N/A"},114.40000000000109,{"$error":"#N/A"},{"$error":"#N/A"},{"$error":"#N/A"},{"$error":"#N/A"},114.40000000000109,{"$error":"#N/A"},{"$error":"#N/A"},{"$error":"#N/A"}]
[{"$nulls":5},{"$error":"#N/A"},114.60000000000109,{"$error":"#N/A"},{"$error":"#N/A"},{"$error":"#N/A"},{"$error":"#N/A"},114.60000000000109,{"$error":"#N/A"},{"$error":"#N/A"},{"$error":"#N/A"},{"$error":"#N/A"},114.60000000000109,{"$error":"#N/A"},{"$error":"#N/A"},{"$error":"#N/A"}]
[{"$nulls":5},{"$error":"#N/A"},114.80000000000109,{"$error":"#N/A"},{"$error":"#N/A"},{"$error":"#N/A"},{"$error":"#N/A"},114.80000000000109,{"$error":"#N/A"},{"$error":"#N/A"},{"$error":"#N/A"},{"$error":"#N/A"},114.80000000000109,{"$error":"#N/A"},{"$error":"#N/A"},{"$error":"#N/A"}]
[{"$nulls":5},{"$error":"#N/A"},115.0000000000011,{"$error":"#N/A"},{"$error":"#N/A"},{"$error":"#N/A"},{"$error":"#N/A"},115.0000000000011,{"$error":"#N/A"},{"$error":"#N/A"},{"$error":"#N/A"},{"$error":"#N/A"},115.0000000000011,{"$error":"#N/A"},{"$error":"#N/A"},{"$error":"#N/A"}]
[{"$nulls":5},{"$error":"#N/A"},115.2000000000011,{"$error":"#N/A"},{"$error":"#N/A"},{"$error":"#N/A"},{"$error":"#N/A"},115.2000000000011,{"$error":"#N/A"},{"$error":"#N/A"},{"$error":"#N/A"},{"$error":"#N/A"},115.2000000000011,{"$error":"#N/A"},{"$error":"#N/A"},{"$error":"#N/A"}]
[{"$nulls":5},{"$error":"#N/A"},115.4000000000011,{"$error":"#N/A"},{"$error":"#N/A"},{"$error":"#N/A"},{"$error":"#N/A"},115.4000000000011,{"$error":"#N/A"},{"$error":"#N/A"},{"$error":"#N/A"},{"$error":"#N/A"},115.4000000000011,{"$error":"#N/A"},{"$error":"#N/A"},{"$error":"#N/A"}]
[{"$nulls":5},{"$error":"#N/A"},115.6000000000011,{"$error":"#N/A"},{"$error":"#N/A"},{"$error":"#N/A"},{"$f":"IF(K580<$N$2,K580+30,NA())","v":{"$error":"#N/A"}},{"$f":"L580+$L$2","v":115.6000000000011},{"$error":"#N/A"},{"$error":"#N/A"},{"$error":"#N/A"},{"$f":"IF(P580<$S$2,P580+30,NA())","v":{"$error":"#N/A"}},115.6000000000011,{"$error":"#N/A"},{"$error":"#N/A"},{"$error":"#N/A"}]
[{"$nulls":5},{"$error":"#N/A"},115.8000000000011,{"$error":"#N/A"},{"$error":"#N/A"},{"$error":"#N/A"},{"$error":"#N/A"},115.8000000000011,{"$error":"#N/A"},{"$error":"#N/A"},{"$error":"#N/A"},{"$error":"#N/A"},115.8000000000011,{"$error":"#N/A"},{"$error":"#N/A"},{"$error":"#N/A"}]
[{"$nulls":5},{"$error":"#N/A"},116.00000000000111,{"$error":"#N/A"},{"$error":"#N/A"},{"$error":"#N/A"},{"$error":"#N/A"},116.00000000000111,{"$error":"#N/A"},{"$error":"#N/A"},{"$error":"#N/A"},{"$error":"#N/A"},116.00000000000111,{"$error":"#N/A"},{"$error":"#N/A"},{"$error":"#N/A"}]
[{"$nulls":5},{"$error":"#N/A"},116.20000000000111,{"$error":"#N/A"},{"$error":"#N/A"},{"$error":"#N/A"},{"$error":"#N/A"},116.20000000000111,{"$error":"#N/A"},{"$error":"#N/A"},{"$error":"#N/A"},{"$error":"#N/A"},116.20000000000111,{"$error":"#N/A"},{"$error":"#N/A"},{"$error":"#N/A"}]
[{"$nulls":5},{"$error":"#N/A"},116.40000000000111,{"$error":"#N/A"},{"$error":"#N/A"},{"$error":"#N/A"},{"$error":"#N/A"},116.40000000000111,{"$error":"#N/A"},{"$error":"#N/A"},{"$error":"#N/A"},{"$error":"#N/A"},116.40000000000111,{"$error":"#N/A"},{"$error":"#N/A"},{"$error":"#N/A"}]
[{"$nulls":5},{"$error":"#N/A"},116.60000000000112,{"$error":"#N/A"},{"$error":"#N/A"},{"$error":"#N/A"},{"$error":"#N/A"},116.60000000000112,{"$error":"#N/A"},{"$error":"#N/A"},{"$error":"#N/A"},{"$error":"#N/A"},116.60000000000112,{"$error":"#N/A"},{"$error":"#N/A"},{"$error":"#N/A"}]
[{"$nulls":5},{"$error":"#N/A"},116.80000000000112,{"$error":"#N/A"},{"$error":"#N/A"},{"$error":"#N/A"},{"$error":"#N/A"},116.80000000000112,{"$error":"#N/A"},{"$error":"#N/A"},{"$error":"#N/A"},{"$error":"#N/A"},116.80000000000112,{"$error":"#N/A"},{"$error":"#N/A"},{"$error":"#N/A"}]
[{"$nulls":5},{"$error":"#N/A"},117.00000000000112,{"$error":"#N/A"},{"$error":"#N/A"},{"$error":"#N/A"},{"$error":"#N/A"},117.00000000000112,{"$error":"#N/A"},{"$error":"#N/A"},{"$error":"#N/A"},{"$error":"#N/A"},117.00000000000112,{"$error":"#N/A"},{"$error":"#N/A"},{"$error":"#N/A"}]
[{"$nulls":5},{"$error":"#N/A"},117.20000000000113,{"$error":"#N/A"},{"$error":"#N/A"},{"$error":"#N/A"},{"$error":"#N/A"},117.20000000000113,{"$error":"#N/A"},{"$error":"#N/A"},{"$error":"#N/A"},{"$error":"#N/A"},117.20000000000113,{"$error":"#N/A"},{"$error":"#N/A"},{"$error":"#N/A"}]
[{"$nulls":5},{"$error":"#N/A"},117.40000000000113,{"$error":"#N/A"},{"$error":"#N/A"},{"$error":"#N/A"},{"$error":"#N/A"},117.40000000000113,{"$error":"#N/A"},{"$error":"#N/A"},{"$error":"#N/A"},{"$error":"#N/A"},117.40000000000113,{"$error":"#N/A"},{"$error":"#N/A"},{"$error":"#N/A"}]
[{"$nulls":5},{"$error":"#N/A"},117.60000000000113,{"$error":"#N/A"},{"$error":"#N/A"},{"$error":"#N/A"},{"$error":"#N/A"},117.60000000000113,{"$error":"#N/A"},{"$error":"#N/A"},{"$error":"#N/A"},{"$error":"#N/A"},117.60000000000113,{"$error":"#N/A"},{"$error":"#N/A"},{"$error":"#N/A"}]
[{"$nulls":5},{"$error":"#N/A"},117.80000000000113,{"$error":"#N/A"},{"$error":"#N/A"},{"$error":"#N/A"},{"$error":"#N/A"},117.80000000000113,{"$error":"#N/A"},{"$error":"#N/A"},{"$error":"#N/A"},{"$error":"#N/A"},117.80000000000113,{"$error":"#N/A"},{"$error":"#N/A"},{"$error":"#N/A"}]
[{"$nulls":5},{"$error":"#N/A"},118.00000000000114,{"$error":"#N/A"},{"$error":"#N/A"},{"$error":"#N/A"},{"$error":"#N/A"},118.00000000000114,{"$error":"#N/A"},{"$error":"#N/A"},{"$error":"#N/A"},{"$error":"#N/A"},118.00000000000114,{"$error":"#N/A"},{"$error":"#N/A"},{"$error":"#N/A"}]
[{"$nulls":5},{"$error":"#N/A"},118.20000000000114,{"$error":"#N/A"},{"$error":"#N/A"},{"$error":"#N/A"},{"$error":"#N/A"},118.20000000000114,{"$error":"#N/A"},{"$error":"#N/A"},{"$error":"#N/A"},{"$error":"#N/A"},118.20000000000114,{"$error":"#N/A"},{"$error":"#N/A"},{"$error":"#N/A"}]
[{"$nulls":5},{"$error":"#N/A"},118.40000000000114,{"$error":"#N/A"},{"$error":"#N/A"},{"$error":"#N/A"},{"$error":"#N/A"},118.40000000000114,{"$error":"#N/A"},{"$error":"#N/A"},{"$error":"#N/A"},{"$error":"#N/A"},118.40000000000114,{"$error":"#N/A"},{"$error":"#N/A"},{"$error":"#N/A"}]
[{"$nulls":5},{"$error":"#N/A"},118.60000000000115,{"$error":"#N/A"},{"$error":"#N/A"},{"$error":"#N/A"},{"$error":"#N/A"},118.60000000000115,{"$error":"#N/A"},{"$error":"#N/A"},{"$error":"#N/A"},{"$error":"#N/A"},118.60000000000115,{"$error":"#N/A"},{"$error":"#N/A"},{"$error":"#N/A"}]
[{"$nulls":5},{"$error":"#N/A"},118.80000000000115,{"$error":"#N/A"},{"$error":"#N/A"},{"$error":"#N/A"},{"$error":"#N/A"},118.80000000000115,{"$error":"#N/A"},{"$error":"#N/A"},{"$error":"#N/A"},{"$error":"#N/A"},118.80000000000115,{"$error":"#N/A"},{"$error":"#N/A"},{"$error":"#N/A"}]
[{"$nulls":5},{"$error":"#N/A"},119.00000000000115,{"$error":"#N/A"},{"$error":"#N/A"},{"$error":"#N/A"},{"$error":"#N/A"},119.00000000000115,{"$error":"#N/A"},{"$error":"#N/A"},{"$error":"#N/A"},{"$error":"#N/A"},119.00000000000115,{"$error":"#N/A"},{"$error":"#N/A"},{"$error":"#N/A"}]
[{"$nulls":5},{"$error":"#N/A"},119.20000000000115,{"$error":"#N/A"},{"$error":"#N/A"},{"$error":"#N/A"},{"$error":"#N/A"},119.20000000000115,{"$error":"#N/A"},{"$error":"#N/A"},{"$error":"#N/A"},{"$error":"#N/A"},119.20000000000115,{"$error":"#N/A"},{"$error":"#N/A"},{"$error":"#N/A"}]
[{"$nulls":5},{"$error":"#N/A"},119.40000000000116,{"$error":"#N/A"},{"$error":"#N/A"},{"$error":"#N/A"},{"$error":"#N/A"},119.40000000000116,{"$error":"#N/A"},{"$error":"#N/A"},{"$error":"#N/A"},{"$error":"#N/A"},119.40000000000116,{"$error":"#N/A"},{"$error":"#N/A"},{"$error":"#N/A"}]
[{"$nulls":5},{"$error":"#N/A"},119.60000000000116,{"$error":"#N/A"},{"$error":"#N/A"},{"$error":"#N/A"},{"$error":"#N/A"},119.60000000000116,{"$error":"#N/A"},{"$error":"#N/A"},{"$error":"#N/A"},{"$error":"#N/A"},119.60000000000116,{"$error":"#N/A"},{"$error":"#N/A"},{"$error":"#N/A"}]
[{"$nulls":5},{"$error":"#N/A"},119.80000000000116,{"$error":"#N/A"},{"$error":"#N/A"},{"$error":"#N/A"},{"$error":"#N/A"},119.80000000000116,{"$error":"#N/A"},{"$error":"#N/A"},{"$error":"#N/A"},{"$error":"#N/A"},119.80000000000116,{"$error":"#N/A"},{"$error":"#N/A"},{"$error":"#N/A"}]
[{"$nulls":5},{"$error":"#N/A"},120.00000000000117,{"$error":"#N/A"},{"$error":"#N/A"},{"$error":"#N/A"},{"$error":"#N/A"},120.00000000000117,{"$error":"#N/A"},{"$error":"#N/A"},{"$error":"#N/A"},{"$error":"#N/A"},120.00000000000117,{"$error":"#N/A"},{"$error":"#N/A"},{"$error":"#N/A"}]
[{"$nulls":5},{"$error":"#N/A"},120.20000000000117,{"$error":"#N/A"},{"$error":"#N/A"},{"$error":"#N/A"},{"$error":"#N/A"},120.20000000000117,{"$error":"#N/A"},{"$error":"#N/A"},{"$error":"#N/A"},{"$error":"#N/A"},120.20000000000117,{"$error":"#N/A"},{"$error":"#N/A"},{"$error":"#N/A"}]
[{"$nulls":5},{"$error":"#N/A"},120.40000000000117,{"$error":"#N/A"},{"$error":"#N/A"},{"$error":"#N/A"},{"$error":"#N/A"},120.40000000000117,{"$error":"#N/A"},{"$error":"#N/A"},{"$error":"#N/A"},{"$error":"#N/A"},120.40000000000117,{"$error":"#N/A"},{"$error":"#N/A"},{"$error":"#N/A"}]
[{"$nulls":5},{"$error":"#N/A"},120.60000000000117,{"$error":"#N/A"},{"$error":"#N/A"},{"$error":"#N/A"},{"$error":"#N/A"},120.60000000000117,{"$error":"#N/A"},{"$error":"#N/A"},{"$error":"#N/A"},{"$error":"#N/A"},120.60000000000117,{"$error":"#N/A"},{"$error":"#N/A"},{"$error":"#N/A"}]
[{"$nulls":5},{"$error":"#N/A"},120.80000000000118,{"$error":"#N/A"},{"$error":"#N/A"},{"$error":"#N/A"},{"$error":"#N/A"},120.80000000000118,{"$error":"#N/A"},{"$error":"#N/A"},{"$error":"#N/A"},{"$error":"#N/A"},120.80000000000118,{"$error":"#N/A"},{"$error":"#N/A"},{"$error":"#N/A"}]
[{"$nulls":5},{"$error":"#N/A"},121.00000000000118,{"$error":"#N/A"},{"$error":"#N/A"},{"$error":"#N/A"},{"$error":"#N/A"},121.00000000000118,{"$error":"#N/A"},{"$error":"#N/A"},{"$error":"#N/A"},{"$error":"#N/A"},121.00000000000118,{"$error":"#N/A"},{"$error":"#N/A"},{"$error":"#N/A"}]
[{"$nulls":5},{"$error":"#N/A"},121.20000000000118,{"$error":"#N/A"},{"$error":"#N/A"},{"$error":"#N/A"},{"$error":"#N/A"},121.20000000000118,{"$error":"#N/A"},{"$error":"#N/A"},{"$error":"#N/A"},{"$error":"#N/A"},121.20000000000118,{"$error":"#N/A"},{"$error":"#N/A"},{"$error":"#N/A"}]
[{"$nulls":5},{"$error":"#N/A"},121.40000000000119,{"$error":"#N/A"},{"$error":"#N/A"},{"$error":"#N/A"},{"$error":"#N/A"},121.40000000000119,{"$error":"#N/A"},{"$error":"#N/A"},{"$error":"#N/A"},{"$error":"#N/A"},121.40000000000119,{"$error":"#N/A"},{"$error":"#N/A"},{"$error":"#N/A"}]
[{"$nulls":5},{"$error":"#N/A"},121.60000000000119,{"$error":"#N/A"},{"$error":"#N/A"},{"$error":"#N/A"},{"$error":"#N/A"},121.60000000000119,{"$error":"#N/A"},{"$error":"#N/A"},{"$error":"#N/A"},{"$error":"#N/A"},121.60000000000119,{"$error":"#N/A"},{"$error":"#N/A"},{"$error":"#N/A"}]
[{"$nulls":5},{"$error":"#N/A"},121.80000000000119,{"$error":"#N/A"},{"$error":"#N/A"},{"$error":"#N/A"},{"$error":"#N/A"},121.80000000000119,{"$error":"#N/A"},{"$error":"#N/A"},{"$error":"#N/A"},{"$error":"#N/A"},121.80000000000119,{"$error":"#N/A"},{"$error":"#N/A"},{"$error":"#N/A"}]
[{"$nulls":5},{"$error":"#N/A"},122.0000000000012,{"$error":"#N/A"},{"$error":"#N/A"},{"$error":"#N/A"},{"$error":"#N/A"},122.0000000000012,{"$error":"#N/A"},{"$error":"#N/A"},{"$error":"#N/A"},{"$error":"#N/A"},122.0000000000012,{"$error":"#N/A"},{"$error":"#N/A"},{"$error":"#N/A"}]
[{"$nulls":5},{"$error":"#N/A"},122.2000000000012,{"$error":"#N/A"},{"$error":"#N/A"},{"$error":"#N/A"},{"$error":"#N/A"},122.2000000000012,{"$error":"#N/A"},{"$error":"#N/A"},{"$error":"#N/A"},{"$error":"#N/A"},122.2000000000012,{"$error":"#N/A"},{"$error":"#N/A"},{"$error":"#N/A"}]
[{"$nulls":5},{"$error":"#N/A"},122.4000000000012,{"$error":"#N/A"},{"$error":"#N/A"},{"$error":"#N/A"},{"$error":"#N/A"},122.4000000000012,{"$error":"#N/A"},{"$error":"#N/A"},{"$error":"#N/A"},{"$error":"#N/A"},122.4000000000012,{"$error":"#N/A"},{"$error":"#N/A"},{"$error":"#N/A"}]
[{"$nulls":5},{"$error":"#N/A"},122.6000000000012,{"$error":"#N/A"},{"$error":"#N/A"},{"$error":"#N/A"},{"$error":"#N/A"},122.6000000000012,{"$error":"#N/A"},{"$error":"#N/A"},{"$error":"#N/A"},{"$error":"#N/A"},122.6000000000012,{"$error":"#N/A"},{"$error":"#N/A"},{"$error":"#N/A"}]
[{"$nulls":5},{"$error":"#N/A"},122.8000000000012,{"$error":"#N/A"},{"$error":"#N/A"},{"$error":"#N/A"},{"$error":"#N/A"},122.8000000000012,{"$error":"#N/A"},{"$error":"#N/A"},{"$error":"#N/A"},{"$error":"#N/A"},122.8000000000012,{"$error":"#N/A"},{"$error":"#N/A"},{"$error":"#N/A"}]
[{"$nulls":5},{"$error":"#N/A"},123.00000000000121,{"$error":"#N/A"},{"$error":"#N/A"},{"$error":"#N/A"},{"$error":"#N/A"},123.00000000000121,{"$error":"#N/A"},{"$error":"#N/A"},{"$error":"#N/A"},{"$error":"#N/A"},123.00000000000121,{"$error":"#N/A"},{"$error":"#N/A"},{"$error":"#N/A"}]
[{"$nulls":5},{"$error":"#N/A"},123.20000000000121,{"$error":"#N/A"},{"$error":"#N/A"},{"$error":"#N/A"},{"$error":"#N/A"},123.20000000000121,{"$error":"#N/A"},{"$error":"#N/A"},{"$error":"#N/A"},{"$error":"#N/A"},123.20000000000121,{"$error":"#N/A"},{"$error":"#N/A"},{"$error":"#N/A"}]
[{"$nulls":5},{"$error":"#N/A"},123.40000000000121,{"$error":"#N/A"},{"$error":"#N/A"},{"$error":"#N/A"},{"$error":"#N/A"},123.40000000000121,{"$error":"#N/A"},{"$error":"#N/A"},{"$error":"#N/A"},{"$error":"#N/A"},123.40000000000121,{"$error":"#N/A"},{"$error":"#N/A"},{"$error":"#N/A"}]
[{"$nulls":5},{"$error":"#N/A"},123.60000000000122,{"$error":"#N/A"},{"$error":"#N/A"},{"$error":"#N/A"},{"$error":"#N/A"},123.60000000000122,{"$error":"#N/A"},{"$error":"#N/A"},{"$error":"#N/A"},{"$error":"#N/A"},123.60000000000122,{"$error":"#N/A"},{"$error":"#N/A"},{"$error":"#N/A"}]
[{"$nulls":5},{"$error":"#N/A"},123.80000000000122,{"$error":"#N/A"},{"$error":"#N/A"},{"$error":"#N/A"},{"$error":"#N/A"},123.80000000000122,{"$error":"#N/A"},{"$error":"#N/A"},{"$error":"#N/A"},{"$error":"#N/A"},123.80000000000122,{"$error":"#N/A"},{"$error":"#N/A"},{"$error":"#N/A"}]
[{"$nulls":5},{"$error":"#N/A"},124.00000000000122,{"$error":"#N/A"},{"$error":"#N/A"},{"$error":"#N/A"},{"$error":"#N/A"},124.00000000000122,{"$error":"#N/A"},{"$error":"#N/A"},{"$error":"#N/A"},{"$error":"#N/A"},124.00000000000122,{"$error":"#N/A"},{"$error":"#N/A"},{"$error":"#N/A"}]
[{"$nulls":5},{"$error":"#N/A"},124.20000000000122,{"$error":"#N/A"},{"$error":"#N/A"},{"$error":"#N/A"},{"$error":"#N/A"},124.20000000000122,{"$error":"#N/A"},{"$error":"#N/A"},{"$error":"#N/A"},{"$error":"#N/A"},124.20000000000122,{"$error":"#N/A"},{"$error":"#N/A"},{"$error":"#N/A"}]
[{"$nulls":5},{"$error":"#N/A"},124.40000000000123,{"$error":"#N/A"},{"$error":"#N/A"},{"$error":"#N/A"},{"$error":"#N/A"},124.40000000000123,{"$error":"#N/A"},{"$error":"#N/A"},{"$error":"#N/A"},{"$error":"#N/A"},124.40000000000123,{"$error":"#N/A"},{"$error":"#N/A"},{"$error":"#N/A"}]
[{"$nulls":5},{"$error":"#N/A"},124.60000000000123,{"$error":"#N/A"},{"$error":"#N/A"},{"$error":"#N/A"},{"$error":"#N/A"},124.60000000000123,{"$error":"#N/A"},{"$error":"#N/A"},{"$error":"#N/A"},{"$error":"#N/A"},124.60000000000123,{"$error":"#N/A"},{"$error":"#N/A"},{"$error":"#N/A"}]
[{"$nulls":5},{"$error":"#N/A"},124.80000000000123,{"$error":"#N/A"},{"$error":"#N/A"},{"$error":"#N/A"},{"$error":"#N/A"},124.80000000000123,{"$error":"#N/A"},{"$error":"#N/A"},{"$error":"#N/A"},{"$error":"#N/A"},124.80000000000123,{"$error":"#N/A"},{"$error":"#N/A"},{"$error":"#N/A"}]
[{"$nulls":5},{"$f":"IF(F627<$I$2,F627+30,NA())","v":{"$error":"#N/A"}},{"$f":"G627+$G$2","v":125.00000000000124},{"$f":"-1+COS(F628*PI()/180)+G628","v":{"$error":"#N/A"}},{"$f":"(F628/$I$2)*($D$8-$D$7)+COS(F628*PI()/180)+$D$7-1","v":{"$error":"#N/A"}},{"$f":"$J$2*SIN(F628*PI()/180)+$B$18","v":{"$error":"#N/A"}},{"$error":"#N/A"},125.00000000000124,{"$f":"-1+COS(K628*PI()/180)+L628","v":{"$error":"#N/A"}},{"$f":"(K628/$N$2)*($D$13-$D$12)+COS(K628*PI()/180)+$D$12-1","v":{"$error":"#N/A"}},{"$f":"$O$2*SIN(K628*PI()/180)+$B$19","v":{"$error":"#N/A"}},{"$error":"#N/A"},{"$f":"Q627+$G$2","v":125.00000000000124},{"$f":"-1+COS(P628*PI()/180)+Q628","v":{"$error":"#N/A"}},{"$f":"(P628/$S$2)*($D$18-$D$17)+COS(P628*PI()/180)+$D$17-1","v":{"$error":"#N/A"}},{"$f":"$T$2*SIN(P628*PI()/180)+$B$20","v":{"$error":"#N/A"}}]
[{"$nulls":5},{"$error":"#N/A"},125.20000000000124,{"$error":"#N/A"},{"$error":"#N/A"},{"$error":"#N/A"},{"$error":"#N/A"},125.20000000000124,{"$error":"#N/A"},{"$error":"#N/A"},{"$error":"#N/A"},{"$error":"#N/A"},125.20000000000124,{"$error":"#N/A"},{"$error":"#N/A"},{"$error":"#N/A"}]
[{"$nulls":5},{"$error":"#N/A"},125.40000000000124,{"$error":"#N/A"},{"$error":"#N/A"},{"$error":"#N/A"},{"$error":"#N/A"},125.40000000000124,{"$error":"#N/A"},{"$error":"#N/A"},{"$error":"#N/A"},{"$error":"#N/A"},125.40000000000124,{"$error":"#N/A"},{"$error":"#N/A"},{"$error":"#N/A"}]
[{"$nulls":5},{"$error":"#N/A"},125.60000000000124,{"$error":"#N/A"},{"$error":"#N/A"},{"$error":"#N/A"},{"$error":"#N/A"},125.60000000000124,{"$error":"#N/A"},{"$error":"#N/A"},{"$error":"#N/A"},{"$error":"#N/A"},125.60000000000124,{"$error":"#N/A"},{"$error":"#N/A"},{"$error":"#N/A"}]
[{"$nulls":5},{"$error":"#N/A"},125.80000000000125,{"$error":"#N/A"},{"$error":"#N/A"},{"$error":"#N/A"},{"$error":"#N/A"},125.80000000000125,{"$error":"#N/A"},{"$error":"#N/A"},{"$error":"#N/A"},{"$error":"#N/A"},125.80000000000125,{"$error":"#N/A"},{"$error":"#N/A"},{"$error":"#N/A"}]
[{"$nulls":5},{"$error":"#N/A"},126.00000000000125,{"$error":"#N/A"},{"$error":"#N/A"},{"$error":"#N/A"},{"$error":"#N/A"},126.00000000000125,{"$error":"#N/A"},{"$error":"#N/A"},{"$error":"#N/A"},{"$error":"#N/A"},126.00000000000125,{"$error":"#N/A"},{"$error":"#N/A"},{"$error":"#N/A"}]
[{"$nulls":5},{"$error":"#N/A"},126.20000000000125,{"$error":"#N/A"},{"$error":"#N/A"},{"$error":"#N/A"},{"$error":"#N/A"},126.20000000000125,{"$error":"#N/A"},{"$error":"#N/A"},{"$error":"#N/A"},{"$error":"#N/A"},126.20000000000125,{"$error":"#N/A"},{"$error":"#N/A"},{"$error":"#N/A"}]
[{"$nulls":5},{"$error":"#N/A"},126.40000000000126,{"$error":"#N/A"},{"$error":"#N/A"},{"$error":"#N/A"},{"$error":"#N/A"},126.40000000000126,{"$error":"#N/A"},{"$error":"#N/A"},{"$error":"#N/A"},{"$error":"#N/A"},126.40000000000126,{"$error":"#N/A"},{"$error":"#N/A"},{"$error":"#N/A"}]
[{"$nulls":5},{"$error":"#N/A"},126.60000000000126,{"$error":"#N/A"},{"$error":"#N/A"},{"$error":"#N/A"},{"$error":"#N/A"},126.60000000000126,{"$error":"#N/A"},{"$error":"#N/A"},{"$error":"#N/A"},{"$error":"#N/A"},126.60000000000126,{"$error":"#N/A"},{"$error":"#N/A"},{"$error":"#N/A"}]
[{"$nulls":5},{"$error":"#N/A"},126.80000000000126,{"$error":"#N/A"},{"$error":"#N/A"},{"$error":"#N/A"},{"$error":"#N/A"},126.80000000000126,{"$error":"#N/A"},{"$error":"#N/A"},{"$error":"#N/A"},{"$error":"#N/A"},126.80000000000126,{"$error":"#N/A"},{"$error":"#N/A"},{"$error":"#N/A"}]
[{"$nulls":5},{"$error":"#N/A"},127.00000000000126,{"$error":"#N/A"},{"$error":"#N/A"},{"$error":"#N/A"},{"$error":"#N/A"},127.00000000000126,{"$error":"#N/A"},{"$error":"#N/A"},{"$error":"#N/A"},{"$error":"#N/A"},127.00000000000126,{"$error":"#N/A"},{"$error":"#N/A"},{"$error":"#N/A"}]
[{"$nulls":5},{"$error":"#N/A"},127.20000000000127,{"$error":"#N/A"},{"$error":"#N/A"},{"$error":"#N/A"},{"$error":"#N/A"},127.20000000000127,{"$error":"#N/A"},{"$error":"#N/A"},{"$error":"#N/A"},{"$error":"#N/A"},127.20000000000127,{"$error":"#N/A"},{"$error":"#N/A"},{"$error":"#N/A"}]
[{"$nulls":5},{"$error":"#N/A"},127.40000000000127,{"$error":"#N/A"},{"$error":"#N/A"},{"$error":"#N/A"},{"$error":"#N/A"},127.40000000000127,{"$error":"#N/A"},{"$error":"#N/A"},{"$error":"#N/A"},{"$error":"#N/A"},127.40000000000127,{"$error":"#N/A"},{"$error":"#N/A"},{"$error":"#N/A"}]
[{"$nulls":5},{"$error":"#N/A"},127.60000000000127,{"$error":"#N/A"},{"$error":"#N/A"},{"$error":"#N/A"},{"$error":"#N/A"},127.60000000000127,{"$error":"#N/A"},{"$error":"#N/A"},{"$error":"#N/A"},{"$error":"#N/A"},127.60000000000127,{"$error":"#N/A"},{"$error":"#N/A"},{"$error":"#N/A"}]
[{"$nulls":5},{"$error":"#N/A"},127.80000000000128,{"$error":"#N/A"},{"$error":"#N/A"},{"$error":"#N/A"},{"$error":"#N/A"},127.80000000000128,{"$error":"#N/A"},{"$error":"#N/A"},{"$error":"#N/A"},{"$error":"#N/A"},127.80000000000128,{"$error":"#N/A"},{"$error":"#N/A"},{"$error":"#N/A"}]
[{"$nulls":5},{"$error":"#N/A"},128.00000000000128,{"$error":"#N/A"},{"$error":"#N/A"},{"$error":"#N/A"},{"$error":"#N/A"},128.00000000000128,{"$error":"#N/A"},{"$error":"#N/A"},{"$error":"#N/A"},{"$error":"#N/A"},128.00000000000128,{"$error":"#N/A"},{"$error":"#N/A"},{"$error":"#N/A"}]
[{"$nulls":5},{"$error":"#N/A"},128.20000000000127,{"$error":"#N/A"},{"$error":"#N/A"},{"$error":"#N/A"},{"$error":"#N/A"},128.20000000000127,{"$error":"#N/A"},{"$error":"#N/A"},{"$error":"#N/A"},{"$error":"#N/A"},128.20000000000127,{"$error":"#N/A"},{"$error":"#N/A"},{"$error":"#N/A"}]
[{"$nulls":5},{"$error":"#N/A"},128.40000000000126,{"$error":"#N/A"},{"$error":"#N/A"},{"$error":"#N/A"},{"$f":"IF(K644<$N$2,K644+30,NA())","v":{"$error":"#N/A"}},{"$f":"L644+$L$2","v":128.40000000000126},{"$error":"#N/A"},{"$error":"#N/A"},{"$error":"#N/A"},{"$f":"IF(P644<$S$2,P644+30,NA())","v":{"$error":"#N/A"}},128.40000000000126,{"$error":"#N/A"},{"$error":"#N/A"},{"$error":"#N/A"}]
[{"$nulls":5},{"$error":"#N/A"},128.60000000000124,{"$error":"#N/A"},{"$error":"#N/A"},{"$error":"#N/A"},{"$error":"#N/A"},128.60000000000124,{"$error":"#N/A"},{"$error":"#N/A"},{"$error":"#N/A"},{"$error":"#N/A"},128.60000000000124,{"$error":"#N/A"},{"$error":"#N/A"},{"$error":"#N/A"}]
[{"$nulls":5},{"$error":"#N/A"},128.80000000000123,{"$error":"#N/A"},{"$error":"#N/A"},{"$error":"#N/A"},{"$error":"#N/A"},128.80000000000123,{"$error":"#N/A"},{"$error":"#N/A"},{"$error":"#N/A"},{"$error":"#N/A"},128.80000000000123,{"$error":"#N/A"},{"$error":"#N/A"},{"$error":"#N/A"}]
[{"$nulls":5},{"$error":"#N/A"},129.00000000000122,{"$error":"#N/A"},{"$error":"#N/A"},{"$error":"#N/A"},{"$error":"#N/A"},129.00000000000122,{"$error":"#N/A"},{"$error":"#N/A"},{"$error":"#N/A"},{"$error":"#N/A"},129.00000000000122,{"$error":"#N/A"},{"$error":"#N/A"},{"$error":"#N/A"}]
[{"$nulls":5},{"$error":"#N/A"},129.2000000000012,{"$error":"#N/A"},{"$error":"#N/A"},{"$error":"#N/A"},{"$error":"#N/A"},129.2000000000012,{"$error":"#N/A"},{"$error":"#N/A"},{"$error":"#N/A"},{"$error":"#N/A"},129.2000000000012,{"$error":"#N/A"},{"$error":"#N/A"},{"$error":"#N/A"}]
[{"$nulls":5},{"$error":"#N/A"},129.4000000000012,{"$error":"#N/A"},{"$error":"#N/A"},{"$error":"#N/A"},{"$error":"#N/A"},129.4000000000012,{"$error":"#N/A"},{"$error":"#N/A"},{"$error":"#N/A"},{"$error":"#N/A"},129.4000000000012,{"$error":"#N/A"},{"$error":"#N/A"},{"$error":"#N/A"}]
[{"$nulls":5},{"$error":"#N/A"},129.6000000000012,{"$error":"#N/A"},{"$error":"#N/A"},{"$error":"#N/A"},{"$error":"#N/A"},129.6000000000012,{"$error":"#N/A"},{"$error":"#N/A"},{"$error":"#N/A"},{"$error":"#N/A"},129.6000000000012,{"$error":"#N/A"},{"$error":"#N/A"},{"$error":"#N/A"}]
[{"$nulls":5},{"$error":"#N/A"},129.80000000000118,{"$error":"#N/A"},{"$error":"#N/A"},{"$error":"#N/A"},{"$error":"#N/A"},129.80000000000118,{"$error":"#N/A"},{"$error":"#N/A"},{"$error":"#N/A"},{"$error":"#N/A"},129.80000000000118,{"$error":"#N/A"},{"$error":"#N/A"},{"$error":"#N/A"}]
[{"$nulls":5},{"$error":"#N/A"},130.00000000000117,{"$error":"#N/A"},{"$error":"#N/A"},{"$error":"#N/A"},{"$error":"#N/A"},130.00000000000117,{"$error":"#N/A"},{"$error":"#N/A"},{"$error":"#N/A"},{"$error":"#N/A"},130.00000000000117,{"$error":"#N/A"},{"$error":"#N/A"},{"$error":"#N/A"}]
[{"$nulls":5},{"$error":"#N/A"},130.20000000000115,{"$error":"#N/A"},{"$error":"#N/A"},{"$error":"#N/A"},{"$error":"#N/A"},130.20000000000115,{"$error":"#N/A"},{"$error":"#N/A"},{"$error":"#N/A"},{"$error":"#N/A"},130.20000000000115,{"$error":"#N/A"},{"$error":"#N/A"},{"$error":"#N/A"}]
[{"$nulls":5},{"$error":"#N/A"},130.40000000000114,{"$error":"#N/A"},{"$error":"#N/A"},{"$error":"#N/A"},{"$error":"#N/A"},130.40000000000114,{"$error":"#N/A"},{"$error":"#N/A"},{"$error":"#N/A"},{"$error":"#N/A"},130.40000000000114,{"$error":"#N/A"},{"$error":"#N/A"},{"$error":"#N/A"}]
[{"$nulls":5},{"$error":"#N/A"},130.60000000000113,{"$error":"#N/A"},{"$error":"#N/A"},{"$error":"#N/A"},{"$error":"#N/A"},130.60000000000113,{"$error":"#N/A"},{"$error":"#N/A"},{"$error":"#N/A"},{"$error":"#N/A"},130.60000000000113,{"$error":"#N/A"},{"$error":"#N/A"},{"$error":"#N/A"}]
[{"$nulls":5},{"$error":"#N/A"},130.80000000000112,{"$error":"#N/A"},{"$error":"#N/A"},{"$error":"#N/A"},{"$error":"#N/A"},130.80000000000112,{"$error":"#N/A"},{"$error":"#N/A"},{"$error":"#N/A"},{"$error":"#N/A"},130.80000000000112,{"$error":"#N/A"},{"$error":"#N/A"},{"$error":"#N/A"}]
[{"$nulls":5},{"$error":"#N/A"},131.0000000000011,{"$error":"#N/A"},{"$error":"#N/A"},{"$error":"#N/A"},{"$error":"#N/A"},131.0000000000011,{"$error":"#N/A"},{"$error":"#N/A"},{"$error":"#N/A"},{"$error":"#N/A"},131.0000000000011,{"$error":"#N/A"},{"$error":"#N/A"},{"$error":"#N/A"}]
[{"$nulls":5},{"$error":"#N/A"},131.2000000000011,{"$error":"#N/A"},{"$error":"#N/A"},{"$error":"#N/A"},{"$error":"#N/A"},131.2000000000011,{"$error":"#N/A"},{"$error":"#N/A"},{"$error":"#N/A"},{"$error":"#N/A"},131.2000000000011,{"$error":"#N/A"},{"$error":"#N/A"},{"$error":"#N/A"}]
[{"$nulls":5},{"$error":"#N/A"},131.40000000000109,{"$error":"#N/A"},{"$error":"#N/A"},{"$error":"#N/A"},{"$error":"#N/A"},131.40000000000109,{"$error":"#N/A"},{"$error":"#N/A"},{"$error":"#N/A"},{"$error":"#N/A"},131.40000000000109,{"$error":"#N/A"},{"$error":"#N/A"},{"$error":"#N/A"}]
[{"$nulls":5},{"$error":"#N/A"},131.60000000000107,{"$error":"#N/A"},{"$error":"#N/A"},{"$error":"#N/A"},{"$error":"#N/A"},131.60000000000107,{"$error":"#N/A"},{"$error":"#N/A"},{"$error":"#N/A"},{"$error":"#N/A"},131.60000000000107,{"$error":"#N/A"},{"$error":"#N/A"},{"$error":"#N/A"}]
[{"$nulls":5},{"$error":"#N/A"},131.80000000000106,{"$error":"#N/A"},{"$error":"#N/A"},{"$error":"#N/A"},{"$error":"#N/A"},131.80000000000106,{"$error":"#N/A"},{"$error":"#N/A"},{"$error":"#N/A"},{"$error":"#N/A"},131.80000000000106,{"$error":"#N/A"},{"$error":"#N/A"},{"$error":"#N/A"}]
[{"$nulls":5},{"$error":"#N/A"},132.00000000000105,{"$error":"#N/A"},{"$error":"#N/A"},{"$error":"#N/A"},{"$error":"#N/A"},132.00000000000105,{"$error":"#N/A"},{"$error":"#N/A"},{"$error":"#N/A"},{"$error":"#N/A"},132.00000000000105,{"$error":"#N/A"},{"$error":"#N/A"},{"$error":"#N/A"}]
[{"$nulls":5},{"$error":"#N/A"},132.20000000000104,{"$error":"#N/A"},{"$error":"#N/A"},{"$error":"#N/A"},{"$error":"#N/A"},132.20000000000104,{"$error":"#N/A"},{"$error":"#N/A"},{"$error":"#N/A"},{"$error":"#N/A"},132.20000000000104,{"$error":"#N/A"},{"$error":"#N/A"},{"$error":"#N/A"}]
[{"$nulls":5},{"$error":"#N/A"},132.40000000000103,{"$error":"#N/A"},{"$error":"#N/A"},{"$error":"#N/A"},{"$error":"#N/A"},132.40000000000103,{"$error":"#N/A"},{"$error":"#N/A"},{"$error":"#N/A"},{"$error":"#N/A"},132.40000000000103,{"$error":"#N/A"},{"$error":"#N/A"},{"$error":"#N/A"}]
[{"$nulls":5},{"$error":"#N/A"},132.60000000000102,{"$error":"#N/A"},{"$error":"#N/A"},{"$error":"#N/A"},{"$error":"#N/A"},132.60000000000102,{"$error":"#N/A"},{"$error":"#N/A"},{"$error":"#N/A"},{"$error":"#N/A"},132.60000000000102,{"$error":"#N/A"},{"$error":"#N/A"},{"$error":"#N/A"}]
[{"$nulls":5},{"$error":"#N/A"},132.800000000001,{"$error":"#N/A"},{"$error":"#N/A"},{"$error":"#N/A"},{"$error":"#N/A"},132.800000000001,{"$error":"#N/A"},{"$error":"#N/A"},{"$error":"#N/A"},{"$error":"#N/A"},132.800000000001,{"$error":"#N/A"},{"$error":"#N/A"},{"$error":"#N/A"}]
[{"$nulls":5},{"$error":"#N/A"},133.000000000001,{"$error":"#N/A"},{"$error":"#N/A"},{"$error":"#N/A"},{"$error":"#N/A"},133.000000000001,{"$error":"#N/A"},{"$error":"#N/A"},{"$error":"#N/A"},{"$error":"#N/A"},133.000000000001,{"$error":"#N/A"},{"$error":"#N/A"},{"$error":"#N/A"}]
[{"$nulls":5},{"$error":"#N/A"},133.20000000000098,{"$error":"#N/A"},{"$error":"#N/A"},{"$error":"#N/A"},{"$error":"#N/A"},133.20000000000098,{"$error":"#N/A"},{"$error":"#N/A"},{"$error":"#N/A"},{"$error":"#N/A"},133.20000000000098,{"$error":"#N/A"},{"$error":"#N/A"},{"$error":"#N/A"}]
[{"$nulls":5},{"$error":"#N/A"},133.40000000000097,{"$error":"#N/A"},{"$error":"#N/A"},{"$error":"#N/A"},{"$error":"#N/A"},133.40000000000097,{"$error":"#N/A"},{"$error":"#N/A"},{"$error":"#N/A"},{"$error":"#N/A"},133.40000000000097,{"$error":"#N/A"},{"$error":"#N/A"},{"$error":"#N/A"}]
[{"$nulls":5},{"$error":"#N/A"},133.60000000000096,{"$error":"#N/A"},{"$error":"#N/A"},{"$error":"#N/A"},{"$error":"#N/A"},133.60000000000096,{"$error":"#N/A"},{"$error":"#N/A"},{"$error":"#N/A"},{"$error":"#N/A"},133.60000000000096,{"$error":"#N/A"},{"$error":"#N/A"},{"$error":"#N/A"}]
[{"$nulls":5},{"$error":"#N/A"},133.80000000000095,{"$error":"#N/A"},{"$error":"#N/A"},{"$error":"#N/A"},{"$error":"#N/A"},133.80000000000095,{"$error":"#N/A"},{"$error":"#N/A"},{"$error":"#N/A"},{"$error":"#N/A"},133.80000000000095,{"$error":"#N/A"},{"$error":"#N/A"},{"$error":"#N/A"}]
[{"$nulls":5},{"$error":"#N/A"},134.00000000000094,{"$error":"#N/A"},{"$error":"#N/A"},{"$error":"#N/A"},{"$error":"#N/A"},134.00000000000094,{"$error":"#N/A"},{"$error":"#N/A"},{"$error":"#N/A"},{"$error":"#N/A"},134.00000000000094,{"$error":"#N/A"},{"$error":"#N/A"},{"$error":"#N/A"}]
[{"$nulls":5},{"$error":"#N/A"},134.20000000000093,{"$error":"#N/A"},{"$error":"#N/A"},{"$error":"#N/A"},{"$error":"#N/A"},134.20000000000093,{"$error":"#N/A"},{"$error":"#N/A"},{"$error":"#N/A"},{"$error":"#N/A"},134.20000000000093,{"$error":"#N/A"},{"$error":"#N/A"},{"$error":"#N/A"}]
[{"$nulls":5},{"$error":"#N/A"},134.40000000000092,{"$error":"#N/A"},{"$error":"#N/A"},{"$error":"#N/A"},{"$error":"#N/A"},134.40000000000092,{"$error":"#N/A"},{"$error":"#N/A"},{"$error":"#N/A"},{"$error":"#N/A"},134.40000000000092,{"$error":"#N/A"},{"$error":"#N/A"},{"$error":"#N/A"}]
[{"$nulls":5},{"$error":"#N/A"},134.6000000000009,{"$error":"#N/A"},{"$error":"#N/A"},{"$error":"#N/A"},{"$error":"#N/A"},134.6000000000009,{"$error":"#N/A"},{"$error":"#N/A"},{"$error":"#N/A"},{"$error":"#N/A"},134.6000000000009,{"$error":"#N/A"},{"$error":"#N/A"},{"$error":"#N/A"}]
[{"$nulls":5},{"$error":"#N/A"},134.8000000000009,{"$error":"#N/A"},{"$error":"#N/A"},{"$error":"#N/A"},{"$error":"#N/A"},134.8000000000009,{"$error":"#N/A"},{"$error":"#N/A"},{"$error":"#N/A"},{"$error":"#N/A"},134.8000000000009,{"$error":"#N/A"},{"$error":"#N/A"},{"$error":"#N/A"}]
[{"$nulls":5},{"$error":"#N/A"},135.00000000000088,{"$error":"#N/A"},{"$error":"#N/A"},{"$error":"#N/A"},{"$error":"#N/A"},135.00000000000088,{"$error":"#N/A"},{"$error":"#N/A"},{"$error":"#N/A"},{"$error":"#N/A"},135.00000000000088,{"$error":"#N/A"},{"$error":"#N/A"},{"$error":"#N/A"}]
[{"$nulls":5},{"$error":"#N/A"},135.20000000000087,{"$error":"#N/A"},{"$error":"#N/A"},{"$error":"#N/A"},{"$error":"#N/A"},135.20000000000087,{"$error":"#N/A"},{"$error":"#N/A"},{"$error":"#N/A"},{"$error":"#N/A"},135.20000000000087,{"$error":"#N/A"},{"$error":"#N/A"},{"$error":"#N/A"}]
[{"$nulls":5},{"$error":"#N/A"},135.40000000000086,{"$error":"#N/A"},{"$error":"#N/A"},{"$error":"#N/A"},{"$error":"#N/A"},135.40000000000086,{"$error":"#N/A"},{"$error":"#N/A"},{"$error":"#N/A"},{"$error":"#N/A"},135.40000000000086,{"$error":"#N/A"},{"$error":"#N/A"},{"$error":"#N/A"}]
[{"$nulls":5},{"$error":"#N/A"},135.60000000000085,{"$error":"#N/A"},{"$error":"#N/A"},{"$error":"#N/A"},{"$error":"#N/A"},135.60000000000085,{"$error":"#N/A"},{"$error":"#N/A"},{"$error":"#N/A"},{"$error":"#N/A"},135.60000000000085,{"$error":"#N/A"},{"$error":"#N/A"},{"$error":"#N/A"}]
[{"$nulls":5},{"$error":"#N/A"},135.80000000000084,{"$error":"#N/A"},{"$error":"#N/A"},{"$error":"#N/A"},{"$error":"#N/A"},135.80000000000084,{"$error":"#N/A"},{"$error":"#N/A"},{"$error":"#N/A"},{"$error":"#N/A"},135.80000000000084,{"$error":"#N/A"},{"$error":"#N/A"},{"$error":"#N/A"}]
[{"$nulls":5},{"$error":"#N/A"},136.00000000000082,{"$error":"#N/A"},{"$error":"#N/A"},{"$error":"#N/A"},{"$error":"#N/A"},136.00000000000082,{"$error":"#N/A"},{"$error":"#N/A"},{"$error":"#N/A"},{"$error":"#N/A"},136.00000000000082,{"$error":"#N/A"},{"$error":"#N/A"},{"$error":"#N/A"}]
[{"$nulls":5},{"$error":"#N/A"},136.2000000000008,{"$error":"#N/A"},{"$error":"#N/A"},{"$error":"#N/A"},{"$error":"#N/A"},136.2000000000008,{"$error":"#N/A"},{"$error":"#N/A"},{"$error":"#N/A"},{"$error":"#N/A"},136.2000000000008,{"$error":"#N/A"},{"$error":"#N/A"},{"$error":"#N/A"}]
[{"$nulls":5},{"$error":"#N/A"},136.4000000000008,{"$error":"#N/A"},{"$error":"#N/A"},{"$error":"#N/A"},{"$error":"#N/A"},136.4000000000008,{"$error":"#N/A"},{"$error":"#N/A"},{"$error":"#N/A"},{"$error":"#N/A"},136.4000000000008,{"$error":"#N/A"},{"$error":"#N/A"},{"$error":"#N/A"}]
[{"$nulls":5},{"$error":"#N/A"},136.6000000000008,{"$error":"#N/A"},{"$error":"#N/A"},{"$error":"#N/A"},{"$error":"#N/A"},136.6000000000008,{"$error":"#N/A"},{"$error":"#N/A"},{"$error":"#N/A"},{"$error":"#N/A"},136.6000000000008,{"$error":"#N/A"},{"$error":"#N/A"},{"$error":"#N/A"}]
[{"$nulls":5},{"$error":"#N/A"},136.80000000000078,{"$error":"#N/A"},{"$error":"#N/A"},{"$error":"#N/A"},{"$error":"#N/A"},136.80000000000078,{"$error":"#N/A"},{"$error":"#N/A"},{"$error":"#N/A"},{"$error":"#N/A"},136.80000000000078,{"$error":"#N/A"},{"$error":"#N/A"},{"$error":"#N/A"}]
[{"$nulls":5},{"$error":"#N/A"},137.00000000000077,{"$error":"#N/A"},{"$error":"#N/A"},{"$error":"#N/A"},{"$error":"#N/A"},137.00000000000077,{"$error":"#N/A"},{"$error":"#N/A"},{"$error":"#N/A"},{"$error":"#N/A"},137.00000000000077,{"$error":"#N/A"},{"$error":"#N/A"},{"$error":"#N/A"}]
[{"$nulls":5},{"$error":"#N/A"},137.20000000000076,{"$error":"#N/A"},{"$error":"#N/A"},{"$error":"#N/A"},{"$error":"#N/A"},137.20000000000076,{"$error":"#N/A"},{"$error":"#N/A"},{"$error":"#N/A"},{"$error":"#N/A"},137.20000000000076,{"$error":"#N/A"},{"$error":"#N/A"},{"$error":"#N/A"}]
[{"$nulls":5},{"$error":"#N/A"},137.40000000000074,{"$error":"#N/A"},{"$error":"#N/A"},{"$error":"#N/A"},{"$error":"#N/A"},137.40000000000074,{"$error":"#N/A"},{"$error":"#N/A"},{"$error":"#N/A"},{"$error":"#N/A"},137.40000000000074,{"$error":"#N/A"},{"$error":"#N/A"},{"$error":"#N/A"}]
[{"$nulls":5},{"$error":"#N/A"},137.60000000000073,{"$error":"#N/A"},{"$error":"#N/A"},{"$error":"#N/A"},{"$error":"#N/A"},137.60000000000073,{"$error":"#N/A"},{"$error":"#N/A"},{"$error":"#N/A"},{"$error":"#N/A"},137.60000000000073,{"$error":"#N/A"},{"$error":"#N/A"},{"$error":"#N/A"}]
[{"$nulls":5},{"$f":"IF(F691<$I$2,F691+30,NA())","v":{"$error":"#N/A"}},{"$f":"G691+$G$2","v":137.80000000000072},{"$f":"-1+COS(F692*PI()/180)+G692","v":{"$error":"#N/A"}},{"$f":"(F692/$I$2)*($D$8-$D$7)+COS(F692*PI()/180)+$D$7-1","v":{"$error":"#N/A"}},{"$f":"$J$2*SIN(F692*PI()/180)+$B$18","v":{"$error":"#N/A"}},{"$error":"#N/A"},137.80000000000072,{"$f":"-1+COS(K692*PI()/180)+L692","v":{"$error":"#N/A"}},{"$f":"(K692/$N$2)*($D$13-$D$12)+COS(K692*PI()/180)+$D$12-1","v":{"$error":"#N/A"}},{"$f":"$O$2*SIN(K692*PI()/180)+$B$19","v":{"$error":"#N/A"}},{"$error":"#N/A"},{"$f":"Q691+$G$2","v":137.80000000000072},{"$f":"-1+COS(P692*PI()/180)+Q692","v":{"$error":"#N/A"}},{"$f":"(P692/$S$2)*($D$18-$D$17)+COS(P692*PI()/180)+$D$17-1","v":{"$error":"#N/A"}},{"$f":"$T$2*SIN(P692*PI()/180)+$B$20","v":{"$error":"#N/A"}}]
[{"$nulls":5},{"$error":"#N/A"},138.0000000000007,{"$error":"#N/A"},{"$error":"#N/A"},{"$error":"#N/A"},{"$error":"#N/A"},138.0000000000007,{"$error":"#N/A"},{"$error":"#N/A"},{"$error":"#N/A"},{"$error":"#N/A"},138.0000000000007,{"$error":"#N/A"},{"$error":"#N/A"},{"$error":"#N/A"}]
[{"$nulls":5},{"$error":"#N/A"},138.2000000000007,{"$error":"#N/A"},{"$error":"#N/A"},{"$error":"#N/A"},{"$error":"#N/A"},138.2000000000007,{"$error":"#N/A"},{"$error":"#N/A"},{"$error":"#N/A"},{"$error":"#N/A"},138.2000000000007,{"$error":"#N/A"},{"$error":"#N/A"},{"$error":"#N/A"}]
[{"$nulls":5},{"$error":"#N/A"},138.4000000000007,{"$error":"#N/A"},{"$error":"#N/A"},{"$error":"#N/A"},{"$error":"#N/A"},138.4000000000007,{"$error":"#N/A"},{"$error":"#N/A"},{"$error":"#N/A"},{"$error":"#N/A"},138.4000000000007,{"$error":"#N/A"},{"$error":"#N/A"},{"$error":"#N/A"}]
[{"$nulls":5},{"$error":"#N/A"},138.60000000000068,{"$error":"#N/A"},{"$error":"#N/A"},{"$error":"#N/A"},{"$error":"#N/A"},138.60000000000068,{"$error":"#N/A"},{"$error":"#N/A"},{"$error":"#N/A"},{"$error":"#N/A"},138.60000000000068,{"$error":"#N/A"},{"$error":"#N/A"},{"$error":"#N/A"}]
[{"$nulls":5},{"$error":"#N/A"},138.80000000000067,{"$error":"#N/A"},{"$error":"#N/A"},{"$error":"#N/A"},{"$error":"#N/A"},138.80000000000067,{"$error":"#N/A"},{"$error":"#N/A"},{"$error":"#N/A"},{"$error":"#N/A"},138.80000000000067,{"$error":"#N/A"},{"$error":"#N/A"},{"$error":"#N/A"}]
[{"$nulls":5},{"$error":"#N/A"},139.00000000000065,{"$error":"#N/A"},{"$error":"#N/A"},{"$error":"#N/A"},{"$error":"#N/A"},139.00000000000065,{"$error":"#N/A"},{"$error":"#N/A"},{"$error":"#N/A"},{"$error":"#N/A"},139.00000000000065,{"$error":"#N/A"},{"$error":"#N/A"},{"$error":"#N/A"}]
[{"$nulls":5},{"$error":"#N/A"},139.20000000000064,{"$error":"#N/A"},{"$error":"#N/A"},{"$error":"#N/A"},{"$error":"#N/A"},139.20000000000064,{"$error":"#N/A"},{"$error":"#N/A"},{"$error":"#N/A"},{"$error":"#N/A"},139.20000000000064,{"$error":"#N/A"},{"$error":"#N/A"},{"$error":"#N/A"}]
[{"$nulls":5},{"$error":"#N/A"},139.40000000000063,{"$error":"#N/A"},{"$error":"#N/A"},{"$error":"#N/A"},{"$error":"#N/A"},139.40000000000063,{"$error":"#N/A"},{"$error":"#N/A"},{"$error":"#N/A"},{"$error":"#N/A"},139.40000000000063,{"$error":"#N/A"},{"$error":"#N/A"},{"$error":"#N/A"}]
[{"$nulls":5},{"$error":"#N/A"},139.60000000000062,{"$error":"#N/A"},{"$error":"#N/A"},{"$error":"#N/A"},{"$error":"#N/A"},139.60000000000062,{"$error":"#N/A"},{"$error":"#N/A"},{"$error":"#N/A"},{"$error":"#N/A"},139.60000000000062,{"$error":"#N/A"},{"$error":"#N/A"},{"$error":"#N/A"}]
[{"$nulls":5},{"$error":"#N/A"},139.8000000000006,{"$error":"#N/A"},{"$error":"#N/A"},{"$error":"#N/A"},{"$error":"#N/A"},139.8000000000006,{"$error":"#N/A"},{"$error":"#N/A"},{"$error":"#N/A"},{"$error":"#N/A"},139.8000000000006,{"$error":"#N/A"},{"$error":"#N/A"},{"$error":"#N/A"}]
[{"$nulls":5},{"$error":"#N/A"},140.0000000000006,{"$error":"#N/A"},{"$error":"#N/A"},{"$error":"#N/A"},{"$error":"#N/A"},140.0000000000006,{"$error":"#N/A"},{"$error":"#N/A"},{"$error":"#N/A"},{"$error":"#N/A"},140.0000000000006,{"$error":"#N/A"},{"$error":"#N/A"},{"$error":"#N/A"}]
[{"$nulls":5},{"$error":"#N/A"},140.20000000000059,{"$error":"#N/A"},{"$error":"#N/A"},{"$error":"#N/A"},{"$error":"#N/A"},140.20000000000059,{"$error":"#N/A"},{"$error":"#N/A"},{"$error":"#N/A"},{"$error":"#N/A"},140.20000000000059,{"$error":"#N/A"},{"$error":"#N/A"},{"$error":"#N/A"}]
[{"$nulls":5},{"$error":"#N/A"},140.40000000000057,{"$error":"#N/A"},{"$error":"#N/A"},{"$error":"#N/A"},{"$error":"#N/A"},140.40000000000057,{"$error":"#N/A"},{"$error":"#N/A"},{"$error":"#N/A"},{"$error":"#N/A"},140.40000000000057,{"$error":"#N/A"},{"$error":"#N/A"},{"$error":"#N/A"}]
[{"$nulls":5},{"$error":"#N/A"},140.60000000000056,{"$error":"#N/A"},{"$error":"#N/A"},{"$error":"#N/A"},{"$error":"#N/A"},140.60000000000056,{"$error":"#N/A"},{"$error":"#N/A"},{"$error":"#N/A"},{"$error":"#N/A"},140.60000000000056,{"$error":"#N/A"},{"$error":"#N/A"},{"$error":"#N/A"}]
[{"$nulls":5},{"$error":"#N/A"},140.80000000000055,{"$error":"#N/A"},{"$error":"#N/A"},{"$error":"#N/A"},{"$error":"#N/A"},140.80000000000055,{"$error":"#N/A"},{"$error":"#N/A"},{"$error":"#N/A"},{"$error":"#N/A"},140.80000000000055,{"$error":"#N/A"},{"$error":"#N/A"},{"$error":"#N/A"}]
[{"$nulls":5},{"$error":"#N/A"},141.00000000000054,{"$error":"#N/A"},{"$error":"#N/A"},{"$error":"#N/A"},{"$error":"#N/A"},141.00000000000054,{"$error":"#N/A"},{"$error":"#N/A"},{"$error":"#N/A"},{"$error":"#N/A"},141.00000000000054,{"$error":"#N/A"},{"$error":"#N/A"},{"$error":"#N/A"}]
[{"$nulls":5},{"$error":"#N/A"},141.20000000000053,{"$error":"#N/A"},{"$error":"#N/A"},{"$error":"#N/A"},{"$f":"IF(K708<$N$2,K708+30,NA())","v":{"$error":"#N/A"}},{"$f":"L708+$L$2","v":141.20000000000053},{"$error":"#N/A"},{"$error":"#N/A"},{"$error":"#N/A"},{"$f":"IF(P708<$S$2,P708+30,NA())","v":{"$error":"#N/A"}},141.20000000000053,{"$error":"#N/A"},{"$error":"#N/A"},{"$error":"#N/A"}]
[{"$nulls":5},{"$error":"#N/A"},141.40000000000052,{"$error":"#N/A"},{"$error":"#N/A"},{"$error":"#N/A"},{"$error":"#N/A"},141.40000000000052,{"$error":"#N/A"},{"$error":"#N/A"},{"$error":"#N/A"},{"$error":"#N/A"},141.40000000000052,{"$error":"#N/A"},{"$error":"#N/A"},{"$error":"#N/A"}]
[{"$nulls":5},{"$error":"#N/A"},141.6000000000005,{"$error":"#N/A"},{"$error":"#N/A"},{"$error":"#N/A"},{"$error":"#N/A"},141.6000000000005,{"$error":"#N/A"},{"$error":"#N/A"},{"$error":"#N/A"},{"$error":"#N/A"},141.6000000000005,{"$error":"#N/A"},{"$error":"#N/A"},{"$error":"#N/A"}]
[{"$nulls":5},{"$error":"#N/A"},141.8000000000005,{"$error":"#N/A"},{"$error":"#N/A"},{"$error":"#N/A"},{"$error":"#N/A"},141.8000000000005,{"$error":"#N/A"},{"$error":"#N/A"},{"$error":"#N/A"},{"$error":"#N/A"},141.8000000000005,{"$error":"#N/A"},{"$error":"#N/A"},{"$error":"#N/A"}]
[{"$nulls":5},{"$error":"#N/A"},142.00000000000048,{"$error":"#N/A"},{"$error":"#N/A"},{"$error":"#N/A"},{"$error":"#N/A"},142.00000000000048,{"$error":"#N/A"},{"$error":"#N/A"},{"$error":"#N/A"},{"$error":"#N/A"},142.00000000000048,{"$error":"#N/A"},{"$error":"#N/A"},{"$error":"#N/A"}]
[{"$nulls":5},{"$error":"#N/A"},142.20000000000047,{"$error":"#N/A"},{"$error":"#N/A"},{"$error":"#N/A"},{"$error":"#N/A"},142.20000000000047,{"$error":"#N/A"},{"$error":"#N/A"},{"$error":"#N/A"},{"$error":"#N/A"},142.20000000000047,{"$error":"#N/A"},{"$error":"#N/A"},{"$error":"#N/A"}]
[{"$nulls":5},{"$error":"#N/A"},142.40000000000046,{"$error":"#N/A"},{"$error":"#N/A"},{"$error":"#N/A"},{"$error":"#N/A"},142.40000000000046,{"$error":"#N/A"},{"$error":"#N/A"},{"$error":"#N/A"},{"$error":"#N/A"},142.40000000000046,{"$error":"#N/A"},{"$error":"#N/A"},{"$error":"#N/A"}]
[{"$nulls":5},{"$error":"#N/A"},142.60000000000045,{"$error":"#N/A"},{"$error":"#N/A"},{"$error":"#N/A"},{"$error":"#N/A"},142.60000000000045,{"$error":"#N/A"},{"$error":"#N/A"},{"$error":"#N/A"},{"$error":"#N/A"},142.60000000000045,{"$error":"#N/A"},{"$error":"#N/A"},{"$error":"#N/A"}]
[{"$nulls":5},{"$error":"#N/A"},142.80000000000044,{"$error":"#N/A"},{"$error":"#N/A"},{"$error":"#N/A"},{"$error":"#N/A"},142.80000000000044,{"$error":"#N/A"},{"$error":"#N/A"},{"$error":"#N/A"},{"$error":"#N/A"},142.80000000000044,{"$error":"#N/A"},{"$error":"#N/A"},{"$error":"#N/A"}]
[{"$nulls":5},{"$error":"#N/A"},143.00000000000043,{"$error":"#N/A"},{"$error":"#N/A"},{"$error":"#N/A"},{"$error":"#N/A"},143.00000000000043,{"$error":"#N/A"},{"$error":"#N/A"},{"$error":"#N/A"},{"$error":"#N/A"},143.00000000000043,{"$error":"#N/A"},{"$error":"#N/A"},{"$error":"#N/A"}]
[{"$nulls":5},{"$error":"#N/A"},143.20000000000041,{"$error":"#N/A"},{"$error":"#N/A"},{"$error":"#N/A"},{"$error":"#N/A"},143.20000000000041,{"$error":"#N/A"},{"$error":"#N/A"},{"$error":"#N/A"},{"$error":"#N/A"},143.20000000000041,{"$error":"#N/A"},{"$error":"#N/A"},{"$error":"#N/A"}]
[{"$nulls":5},{"$error":"#N/A"},143.4000000000004,{"$error":"#N/A"},{"$error":"#N/A"},{"$error":"#N/A"},{"$error":"#N/A"},143.4000000000004,{"$error":"#N/A"},{"$error":"#N/A"},{"$error":"#N/A"},{"$error":"#N/A"},143.4000000000004,{"$error":"#N/A"},{"$error":"#N/A"},{"$error":"#N/A"}]
[{"$nulls":5},{"$error":"#N/A"},143.6000000000004,{"$error":"#N/A"},{"$error":"#N/A"},{"$error":"#N/A"},{"$error":"#N/A"},143.6000000000004,{"$error":"#N/A"},{"$error":"#N/A"},{"$error":"#N/A"},{"$error":"#N/A"},143.6000000000004,{"$error":"#N/A"},{"$error":"#N/A"},{"$error":"#N/A"}]
[{"$nulls":5},{"$error":"#N/A"},143.80000000000038,{"$error":"#N/A"},{"$error":"#N/A"},{"$error":"#N/A"},{"$error":"#N/A"},143.80000000000038,{"$error":"#N/A"},{"$error":"#N/A"},{"$error":"#N/A"},{"$error":"#N/A"},143.80000000000038,{"$error":"#N/A"},{"$error":"#N/A"},{"$error":"#N/A"}]
[{"$nulls":5},{"$error":"#N/A"},144.00000000000037,{"$error":"#N/A"},{"$error":"#N/A"},{"$error":"#N/A"},{"$error":"#N/A"},144.00000000000037,{"$error":"#N/A"},{"$error":"#N/A"},{"$error":"#N/A"},{"$error":"#N/A"},144.00000000000037,{"$error":"#N/A"},{"$error":"#N/A"},{"$error":"#N/A"}]
[{"$nulls":5},{"$error":"#N/A"},144.20000000000036,{"$error":"#N/A"},{"$error":"#N/A"},{"$error":"#N/A"},{"$error":"#N/A"},144.20000000000036,{"$error":"#N/A"},{"$error":"#N/A"},{"$error":"#N/A"},{"$error":"#N/A"},144.20000000000036,{"$error":"#N/A"},{"$error":"#N/A"},{"$error":"#N/A"}]
[{"$nulls":5},{"$error":"#N/A"},144.40000000000035,{"$error":"#N/A"},{"$error":"#N/A"},{"$error":"#N/A"},{"$error":"#N/A"},144.40000000000035,{"$error":"#N/A"},{"$error":"#N/A"},{"$error":"#N/A"},{"$error":"#N/A"},144.40000000000035,{"$error":"#N/A"},{"$error":"#N/A"},{"$error":"#N/A"}]
[{"$nulls":5},{"$error":"#N/A"},144.60000000000034,{"$error":"#N/A"},{"$error":"#N/A"},{"$error":"#N/A"},{"$error":"#N/A"},144.60000000000034,{"$error":"#N/A"},{"$error":"#N/A"},{"$error":"#N/A"},{"$error":"#N/A"},144.60000000000034,{"$error":"#N/A"},{"$error":"#N/A"},{"$error":"#N/A"}]
[{"$nulls":5},{"$error":"#N/A"},144.80000000000032,{"$error":"#N/A"},{"$error":"#N/A"},{"$error":"#N/A"},{"$error":"#N/A"},144.80000000000032,{"$error":"#N/A"},{"$error":"#N/A"},{"$error":"#N/A"},{"$error":"#N/A"},144.80000000000032,{"$error":"#N/A"},{"$error":"#N/A"},{"$error":"#N/A"}]
[{"$nulls":5},{"$error":"#N/A"},145.0000000000003,{"$error":"#N/A"},{"$error":"#N/A"},{"$error":"#N/A"},{"$error":"#N/A"},145.0000000000003,{"$error":"#N/A"},{"$error":"#N/A"},{"$error":"#N/A"},{"$error":"#N/A"},145.0000000000003,{"$error":"#N/A"},{"$error":"#N/A"},{"$error":"#N/A"}]
[{"$nulls":5},{"$error":"#N/A"},145.2000000000003,{"$error":"#N/A"},{"$error":"#N/A"},{"$error":"#N/A"},{"$error":"#N/A"},145.2000000000003,{"$error":"#N/A"},{"$error":"#N/A"},{"$error":"#N/A"},{"$error":"#N/A"},145.2000000000003,{"$error":"#N/A"},{"$error":"#N/A"},{"$error":"#N/A"}]
[{"$nulls":5},{"$error":"#N/A"},145.4000000000003,{"$error":"#N/A"},{"$error":"#N/A"},{"$error":"#N/A"},{"$error":"#N/A"},145.4000000000003,{"$error":"#N/A"},{"$error":"#N/A"},{"$error":"#N/A"},{"$error":"#N/A"},145.4000000000003,{"$error":"#N/A"},{"$error":"#N/A"},{"$error":"#N/A"}]
[{"$nulls":5},{"$error":"#N/A"},145.60000000000028,{"$error":"#N/A"},{"$error":"#N/A"},{"$error":"#N/A"},{"$error":"#N/A"},145.60000000000028,{"$error":"#N/A"},{"$error":"#N/A"},{"$error":"#N/A"},{"$error":"#N/A"},145.60000000000028,{"$error":"#N/A"},{"$error":"#N/A"},{"$error":"#N/A"}]
[{"$nulls":5},{"$error":"#N/A"},145.80000000000027,{"$error":"#N/A"},{"$error":"#N/A"},{"$error":"#N/A"},{"$error":"#N/A"},145.80000000000027,{"$error":"#N/A"},{"$error":"#N/A"},{"$error":"#N/A"},{"$error":"#N/A"},145.80000000000027,{"$error":"#N/A"},{"$error":"#N/A"},{"$error":"#N/A"}]
[{"$nulls":5},{"$error":"#N/A"},146.00000000000026,{"$error":"#N/A"},{"$error":"#N/A"},{"$error":"#N/A"},{"$error":"#N/A"},146.00000000000026,{"$error":"#N/A"},{"$error":"#N/A"},{"$error":"#N/A"},{"$error":"#N/A"},146.00000000000026,{"$error":"#N/A"},{"$error":"#N/A"},{"$error":"#N/A"}]
[{"$nulls":5},{"$error":"#N/A"},146.20000000000024,{"$error":"#N/A"},{"$error":"#N/A"},{"$error":"#N/A"},{"$error":"#N/A"},146.20000000000024,{"$error":"#N/A"},{"$error":"#N/A"},{"$error":"#N/A"},{"$error":"#N/A"},146.20000000000024,{"$error":"#N/A"},{"$error":"#N/A"},{"$error":"#N/A"}]
[{"$nulls":5},{"$error":"#N/A"},146.40000000000023,{"$error":"#N/A"},{"$error":"#N/A"},{"$error":"#N/A"},{"$error":"#N/A"},146.40000000000023,{"$error":"#N/A"},{"$error":"#N/A"},{"$error":"#N/A"},{"$error":"#N/A"},146.40000000000023,{"$error":"#N/A"},{"$error":"#N/A"},{"$error":"#N/A"}]
[{"$nulls":5},{"$error":"#N/A"},146.60000000000022,{"$error":"#N/A"},{"$error":"#N/A"},{"$error":"#N/A"},{"$error":"#N/A"},146.60000000000022,{"$error":"#N/A"},{"$error":"#N/A"},{"$error":"#N/A"},{"$error":"#N/A"},146.60000000000022,{"$error":"#N/A"},{"$error":"#N/A"},{"$error":"#N/A"}]
[{"$nulls":5},{"$error":"#N/A"},146.8000000000002,{"$error":"#N/A"},{"$error":"#N/A"},{"$error":"#N/A"},{"$error":"#N/A"},146.8000000000002,{"$error":"#N/A"},{"$error":"#N/A"},{"$error":"#N/A"},{"$error":"#N/A"},146.8000000000002,{"$error":"#N/A"},{"$error":"#N/A"},{"$error":"#N/A"}]
[{"$nulls":5},{"$error":"#N/A"},147.0000000000002,{"$error":"#N/A"},{"$error":"#N/A"},{"$error":"#N/A"},{"$error":"#N/A"},147.0000000000002,{"$error":"#N/A"},{"$error":"#N/A"},{"$error":"#N/A"},{"$error":"#N/A"},147.0000000000002,{"$error":"#N/A"},{"$error":"#N/A"},{"$error":"#N/A"}]
[{"$nulls":5},{"$error":"#N/A"},147.2000000000002,{"$error":"#N/A"},{"$error":"#N/A"},{"$error":"#N/A"},{"$error":"#N/A"},147.2000000000002,{"$error":"#N/A"},{"$error":"#N/A"},{"$error":"#N/A"},{"$error":"#N/A"},147.2000000000002,{"$error":"#N/A"},{"$error":"#N/A"},{"$error":"#N/A"}]
[{"$nulls":5},{"$error":"#N/A"},147.40000000000018,{"$error":"#N/A"},{"$error":"#N/A"},{"$error":"#N/A"},{"$error":"#N/A"},147.40000000000018,{"$error":"#N/A"},{"$error":"#N/A"},{"$error":"#N/A"},{"$error":"#N/A"},147.40000000000018,{"$error":"#N/A"},{"$error":"#N/A"},{"$error":"#N/A"}]
[{"$nulls":5},{"$error":"#N/A"},147.60000000000016,{"$error":"#N/A"},{"$error":"#N/A"},{"$error":"#N/A"},{"$error":"#N/A"},147.60000000000016,{"$error":"#N/A"},{"$error":"#N/A"},{"$error":"#N/A"},{"$error":"#N/A"},147.60000000000016,{"$error":"#N/A"},{"$error":"#N/A"},{"$error":"#N/A"}]
[{"$nulls":5},{"$error":"#N/A"},147.80000000000015,{"$error":"#N/A"},{"$error":"#N/A"},{"$error":"#N/A"},{"$error":"#N/A"},147.80000000000015,{"$error":"#N/A"},{"$error":"#N/A"},{"$error":"#N/A"},{"$error":"#N/A"},147.80000000000015,{"$error":"#N/A"},{"$error":"#N/A"},{"$error":"#N/A"}]
[{"$nulls":5},{"$f":"IF(F742<$I$2,F742+30,NA())","v":{"$error":"#N/A"}},{"$f":"G742+$G$2","v":148.00000000000014},{"$f":"-1+COS(F743*PI()/180)+G743","v":{"$error":"#N/A"}},{"$f":"(F743/$I$2)*($D$8-$D$7)+COS(F743*PI()/180)+$D$7-1","v":{"$error":"#N/A"}},{"$f":"$J$2*SIN(F743*PI()/180)+$B$18","v":{"$error":"#N/A"}},{"$error":"#N/A"},148.00000000000014,{"$f":"-1+COS(K743*PI()/180)+L743","v":{"$error":"#N/A"}},{"$f":"(K743/$N$2)*($D$13-$D$12)+COS(K743*PI()/180)+$D$12-1","v":{"$error":"#N/A"}},{"$f":"$O$2*SIN(K743*PI()/180)+$B$19","v":{"$error":"#N/A"}},{"$error":"#N/A"},{"$f":"Q742+$G$2","v":148.00000000000014},{"$f":"-1+COS(P743*PI()/180)+Q743","v":{"$error":"#N/A"}},{"$f":"(P743/$S$2)*($D$18-$D$17)+COS(P743*PI()/180)+$D$17-1","v":{"$error":"#N/A"}},{"$f":"$T$2*SIN(P743*PI()/180)+$B$20","v":{"$error":"#N/A"}}]
[{"$nulls":5},{"$error":"#N/A"},148.20000000000013,{"$error":"#N/A"},{"$error":"#N/A"},{"$error":"#N/A"},{"$error":"#N/A"},148.20000000000013,{"$error":"#N/A"},{"$error":"#N/A"},{"$error":"#N/A"},{"$error":"#N/A"},148.20000000000013,{"$error":"#N/A"},{"$error":"#N/A"},{"$error":"#N/A"}]
[{"$nulls":5},{"$error":"#N/A"},148.40000000000012,{"$error":"#N/A"},{"$error":"#N/A"},{"$error":"#N/A"},{"$error":"#N/A"},148.40000000000012,{"$error":"#N/A"},{"$error":"#N/A"},{"$error":"#N/A"},{"$error":"#N/A"},148.40000000000012,{"$error":"#N/A"},{"$error":"#N/A"},{"$error":"#N/A"}]
[{"$nulls":5},{"$error":"#N/A"},148.6000000000001,{"$error":"#N/A"},{"$error":"#N/A"},{"$error":"#N/A"},{"$error":"#N/A"},148.6000000000001,{"$error":"#N/A"},{"$error":"#N/A"},{"$error":"#N/A"},{"$error":"#N/A"},148.6000000000001,{"$error":"#N/A"},{"$error":"#N/A"},{"$error":"#N/A"}]
[{"$nulls":5},{"$error":"#N/A"},148.8000000000001,{"$error":"#N/A"},{"$error":"#N/A"},{"$error":"#N/A"},{"$error":"#N/A"},148.8000000000001,{"$error":"#N/A"},{"$error":"#N/A"},{"$error":"#N/A"},{"$error":"#N/A"},148.8000000000001,{"$error":"#N/A"},{"$error":"#N/A"},{"$error":"#N/A"}]
[{"$nulls":5},{"$error":"#N/A"},149.00000000000009,{"$error":"#N/A"},{"$error":"#N/A"},{"$error":"#N/A"},{"$error":"#N/A"},149.00000000000009,{"$error":"#N/A"},{"$error":"#N/A"},{"$error":"#N/A"},{"$error":"#N/A"},149.00000000000009,{"$error":"#N/A"},{"$error":"#N/A"},{"$error":"#N/A"}]
[{"$nulls":5},{"$error":"#N/A"},149.20000000000007,{"$error":"#N/A"},{"$error":"#N/A"},{"$error":"#N/A"},{"$error":"#N/A"},149.20000000000007,{"$error":"#N/A"},{"$error":"#N/A"},{"$error":"#N/A"},{"$error":"#N/A"},149.20000000000007,{"$error":"#N/A"},{"$error":"#N/A"},{"$error":"#N/A"}]
[{"$nulls":5},{"$error":"#N/A"},149.40000000000006,{"$error":"#N/A"},{"$error":"#N/A"},{"$error":"#N/A"},{"$error":"#N/A"},149.40000000000006,{"$error":"#N/A"},{"$error":"#N/A"},{"$error":"#N/A"},{"$error":"#N/A"},149.40000000000006,{"$error":"#N/A"},{"$error":"#N/A"},{"$error":"#N/A"}]
[{"$nulls":5},{"$error":"#N/A"},149.60000000000005,{"$error":"#N/A"},{"$error":"#N/A"},{"$error":"#N/A"},{"$error":"#N/A"},149.60000000000005,{"$error":"#N/A"},{"$error":"#N/A"},{"$error":"#N/A"},{"$error":"#N/A"},149.60000000000005,{"$error":"#N/A"},{"$error":"#N/A"},{"$error":"#N/A"}]
[{"$nulls":5},{"$error":"#N/A"},149.80000000000004,{"$error":"#N/A"},{"$error":"#N/A"},{"$error":"#N/A"},{"$error":"#N/A"},149.80000000000004,{"$error":"#N/A"},{"$error":"#N/A"},{"$error":"#N/A"},{"$error":"#N/A"},149.80000000000004,{"$error":"#N/A"},{"$error":"#N/A"},{"$error":"#N/A"}]
[{"$nulls":5},{"$error":"#N/A"},150.00000000000003,{"$error":"#N/A"},{"$error":"#N/A"},{"$error":"#N/A"},{"$error":"#N/A"},150.00000000000003,{"$error":"#N/A"},{"$error":"#N/A"},{"$error":"#N/A"},{"$error":"#N/A"},150.00000000000003,{"$error":"#N/A"},{"$error":"#N/A"},{"$error":"#N/A"}]
[{"$nulls":5},{"$error":"#N/A"},150.20000000000002,{"$error":"#N/A"},{"$error":"#N/A"},{"$error":"#N/A"},{"$error":"#N/A"},150.20000000000002,{"$error":"#N/A"},{"$error":"#N/A"},{"$error":"#N/A"},{"$error":"#N/A"},150.20000000000002,{"$error":"#N/A"},{"$error":"#N/A"},{"$error":"#N/A"}]
[{"$nulls":5},{"$error":"#N/A"},150.4,{"$error":"#N/A"},{"$error":"#N/A"},{"$error":"#N/A"},{"$error":"#N/A"},150.4,{"$error":"#N/A"},{"$error":"#N/A"},{"$error":"#N/A"},{"$error":"#N/A"},150.4,{"$error":"#N/A"},{"$error":"#N/A"},{"$error":"#N/A"}]
[{"$nulls":5},{"$error":"#N/A"},150.6,{"$error":"#N/A"},{"$error":"#N/A"},{"$error":"#N/A"},{"$error":"#N/A"},150.6,{"$error":"#N/A"},{"$error":"#N/A"},{"$error":"#N/A"},{"$error":"#N/A"},150.6,{"$error":"#N/A"},{"$error":"#N/A"},{"$error":"#N/A"}]
[{"$nulls":5},{"$error":"#N/A"},150.79999999999998,{"$error":"#N/A"},{"$error":"#N/A"},{"$error":"#N/A"},{"$error":"#N/A"},150.79999999999998,{"$error":"#N/A"},{"$error":"#N/A"},{"$error":"#N/A"},{"$error":"#N/A"},150.79999999999998,{"$error":"#N/A"},{"$error":"#N/A"},{"$error":"#N/A"}]
[{"$nulls":5},{"$error":"#N/A"},150.99999999999997,{"$error":"#N/A"},{"$error":"#N/A"},{"$error":"#N/A"},{"$error":"#N/A"},150.99999999999997,{"$error":"#N/A"},{"$error":"#N/A"},{"$error":"#N/A"},{"$error":"#N/A"},150.99999999999997,{"$error":"#N/A"},{"$error":"#N/A"},{"$error":"#N/A"}]
[{"$nulls":5},{"$error":"#N/A"},151.19999999999996,{"$error":"#N/A"},{"$error":"#N/A"},{"$error":"#N/A"},{"$error":"#N/A"},151.19999999999996,{"$error":"#N/A"},{"$error":"#N/A"},{"$error":"#N/A"},{"$error":"#N/A"},151.19999999999996,{"$error":"#N/A"},{"$error":"#N/A"},{"$error":"#N/A"}]
[{"$nulls":5},{"$error":"#N/A"},151.39999999999995,{"$error":"#N/A"},{"$error":"#N/A"},{"$error":"#N/A"},{"$error":"#N/A"},151.39999999999995,{"$error":"#N/A"},{"$error":"#N/A"},{"$error":"#N/A"},{"$error":"#N/A"},151.39999999999995,{"$error":"#N/A"},{"$error":"#N/A"},{"$error":"#N/A"}]
[{"$nulls":5},{"$error":"#N/A"},151.59999999999994,{"$error":"#N/A"},{"$error":"#N/A"},{"$error":"#N/A"},{"$error":"#N/A"},151.59999999999994,{"$error":"#N/A"},{"$error":"#N/A"},{"$error":"#N/A"},{"$error":"#N/A"},151.59999999999994,{"$error":"#N/A"},{"$error":"#N/A"},{"$error":"#N/A"}]
[{"$nulls":5},{"$error":"#N/A"},151.79999999999993,{"$error":"#N/A"},{"$error":"#N/A"},{"$error":"#N/A"},{"$error":"#N/A"},151.79999999999993,{"$error":"#N/A"},{"$error":"#N/A"},{"$error":"#N/A"},{"$error":"#N/A"},151.79999999999993,{"$error":"#N/A"},{"$error":"#N/A"},{"$error":"#N/A"}]
[{"$nulls":5},{"$error":"#N/A"},151.99999999999991,{"$error":"#N/A"},{"$error":"#N/A"},{"$error":"#N/A"},{"$error":"#N/A"},151.99999999999991,{"$error":"#N/A"},{"$error":"#N/A"},{"$error":"#N/A"},{"$error":"#N/A"},151.99999999999991,{"$error":"#N/A"},{"$error":"#N/A"},{"$error":"#N/A"}]
[{"$nulls":5},{"$error":"#N/A"},152.1999999999999,{"$error":"#N/A"},{"$error":"#N/A"},{"$error":"#N/A"},{"$error":"#N/A"},152.1999999999999,{"$error":"#N/A"},{"$error":"#N/A"},{"$error":"#N/A"},{"$error":"#N/A"},152.1999999999999,{"$error":"#N/A"},{"$error":"#N/A"},{"$error":"#N/A"}]
[{"$nulls":5},{"$error":"#N/A"},152.3999999999999,{"$error":"#N/A"},{"$error":"#N/A"},{"$error":"#N/A"},{"$error":"#N/A"},152.3999999999999,{"$error":"#N/A"},{"$error":"#N/A"},{"$error":"#N/A"},{"$error":"#N/A"},152.3999999999999,{"$error":"#N/A"},{"$error":"#N/A"},{"$error":"#N/A"}]
[{"$nulls":5},{"$error":"#N/A"},152.59999999999988,{"$error":"#N/A"},{"$error":"#N/A"},{"$error":"#N/A"},{"$error":"#N/A"},152.59999999999988,{"$error":"#N/A"},{"$error":"#N/A"},{"$error":"#N/A"},{"$error":"#N/A"},152.59999999999988,{"$error":"#N/A"},{"$error":"#N/A"},{"$error":"#N/A"}]
[{"$nulls":5},{"$error":"#N/A"},152.79999999999987,{"$error":"#N/A"},{"$error":"#N/A"},{"$error":"#N/A"},{"$error":"#N/A"},152.79999999999987,{"$error":"#N/A"},{"$error":"#N/A"},{"$error":"#N/A"},{"$error":"#N/A"},152.79999999999987,{"$error":"#N/A"},{"$error":"#N/A"},{"$error":"#N/A"}]
[{"$nulls":5},{"$error":"#N/A"},152.99999999999986,{"$error":"#N/A"},{"$error":"#N/A"},{"$error":"#N/A"},{"$error":"#N/A"},152.99999999999986,{"$error":"#N/A"},{"$error":"#N/A"},{"$error":"#N/A"},{"$error":"#N/A"},152.99999999999986,{"$error":"#N/A"},{"$error":"#N/A"},{"$error":"#N/A"}]
[{"$nulls":5},{"$error":"#N/A"},153.19999999999985,{"$error":"#N/A"},{"$error":"#N/A"},{"$error":"#N/A"},{"$error":"#N/A"},153.19999999999985,{"$error":"#N/A"},{"$error":"#N/A"},{"$error":"#N/A"},{"$error":"#N/A"},153.19999999999985,{"$error":"#N/A"},{"$error":"#N/A"},{"$error":"#N/A"}]
[{"$nulls":5},{"$error":"#N/A"},153.39999999999984,{"$error":"#N/A"},{"$error":"#N/A"},{"$error":"#N/A"},{"$error":"#N/A"},153.39999999999984,{"$error":"#N/A"},{"$error":"#N/A"},{"$error":"#N/A"},{"$error":"#N/A"},153.39999999999984,{"$error":"#N/A"},{"$error":"#N/A"},{"$error":"#N/A"}]
[{"$nulls":5},{"$error":"#N/A"},153.59999999999982,{"$error":"#N/A"},{"$error":"#N/A"},{"$error":"#N/A"},{"$error":"#N/A"},153.59999999999982,{"$error":"#N/A"},{"$error":"#N/A"},{"$error":"#N/A"},{"$error":"#N/A"},153.59999999999982,{"$error":"#N/A"},{"$error":"#N/A"},{"$error":"#N/A"}]
[{"$nulls":5},{"$error":"#N/A"},153.7999999999998,{"$error":"#N/A"},{"$error":"#N/A"},{"$error":"#N/A"},{"$error":"#N/A"},153.7999999999998,{"$error":"#N/A"},{"$error":"#N/A"},{"$error":"#N/A"},{"$error":"#N/A"},153.7999999999998,{"$error":"#N/A"},{"$error":"#N/A"},{"$error":"#N/A"}]
[{"$nulls":5},{"$error":"#N/A"},153.9999999999998,{"$error":"#N/A"},{"$error":"#N/A"},{"$error":"#N/A"},{"$f":"IF(K772<$N$2,K772+30,NA())","v":{"$error":"#N/A"}},{"$f":"L772+$L$2","v":153.9999999999998},{"$error":"#N/A"},{"$error":"#N/A"},{"$error":"#N/A"},{"$f":"IF(P772<$S$2,P772+30,NA())","v":{"$error":"#N/A"}},153.9999999999998,{"$error":"#N/A"},{"$error":"#N/A"},{"$error":"#N/A"}]
[{"$nulls":5},{"$error":"#N/A"},154.1999999999998,{"$error":"#N/A"},{"$error":"#N/A"},{"$error":"#N/A"},{"$error":"#N/A"},154.1999999999998,{"$error":"#N/A"},{"$error":"#N/A"},{"$error":"#N/A"},{"$error":"#N/A"},154.1999999999998,{"$error":"#N/A"},{"$error":"#N/A"},{"$error":"#N/A"}]
[{"$nulls":5},{"$error":"#N/A"},154.39999999999978,{"$error":"#N/A"},{"$error":"#N/A"},{"$error":"#N/A"},{"$error":"#N/A"},154.39999999999978,{"$error":"#N/A"},{"$error":"#N/A"},{"$error":"#N/A"},{"$error":"#N/A"},154.39999999999978,{"$error":"#N/A"},{"$error":"#N/A"},{"$error":"#N/A"}]
[{"$nulls":5},{"$error":"#N/A"},154.59999999999977,{"$error":"#N/A"},{"$error":"#N/A"},{"$error":"#N/A"},{"$error":"#N/A"},154.59999999999977,{"$error":"#N/A"},{"$error":"#N/A"},{"$error":"#N/A"},{"$error":"#N/A"},154.59999999999977,{"$error":"#N/A"},{"$error":"#N/A"},{"$error":"#N/A"}]
[{"$nulls":5},{"$error":"#N/A"},154.79999999999976,{"$error":"#N/A"},{"$error":"#N/A"},{"$error":"#N/A"},{"$error":"#N/A"},154.79999999999976,{"$error":"#N/A"},{"$error":"#N/A"},{"$error":"#N/A"},{"$error":"#N/A"},154.79999999999976,{"$error":"#N/A"},{"$error":"#N/A"},{"$error":"#N/A"}]
[{"$nulls":5},{"$error":"#N/A"},154.99999999999974,{"$error":"#N/A"},{"$error":"#N/A"},{"$error":"#N/A"},{"$error":"#N/A"},154.99999999999974,{"$error":"#N/A"},{"$error":"#N/A"},{"$error":"#N/A"},{"$error":"#N/A"},154.99999999999974,{"$error":"#N/A"},{"$error":"#N/A"},{"$error":"#N/A"}]
[{"$nulls":5},{"$error":"#N/A"},155.19999999999973,{"$error":"#N/A"},{"$error":"#N/A"},{"$error":"#N/A"},{"$error":"#N/A"},155.19999999999973,{"$error":"#N/A"},{"$error":"#N/A"},{"$error":"#N/A"},{"$error":"#N/A"},155.19999999999973,{"$error":"#N/A"},{"$error":"#N/A"},{"$error":"#N/A"}]
[{"$nulls":5},{"$error":"#N/A"},155.39999999999972,{"$error":"#N/A"},{"$error":"#N/A"},{"$error":"#N/A"},{"$error":"#N/A"},155.39999999999972,{"$error":"#N/A"},{"$error":"#N/A"},{"$error":"#N/A"},{"$error":"#N/A"},155.39999999999972,{"$error":"#N/A"},{"$error":"#N/A"},{"$error":"#N/A"}]
[{"$nulls":5},{"$error":"#N/A"},155.5999999999997,{"$error":"#N/A"},{"$error":"#N/A"},{"$error":"#N/A"},{"$error":"#N/A"},155.5999999999997,{"$error":"#N/A"},{"$error":"#N/A"},{"$error":"#N/A"},{"$error":"#N/A"},155.5999999999997,{"$error":"#N/A"},{"$error":"#N/A"},{"$error":"#N/A"}]
[{"$nulls":5},{"$error":"#N/A"},155.7999999999997,{"$error":"#N/A"},{"$error":"#N/A"},{"$error":"#N/A"},{"$error":"#N/A"},155.7999999999997,{"$error":"#N/A"},{"$error":"#N/A"},{"$error":"#N/A"},{"$error":"#N/A"},155.7999999999997,{"$error":"#N/A"},{"$error":"#N/A"},{"$error":"#N/A"}]
[{"$nulls":5},{"$error":"#N/A"},155.9999999999997,{"$error":"#N/A"},{"$error":"#N/A"},{"$error":"#N/A"},{"$error":"#N/A"},155.9999999999997,{"$error":"#N/A"},{"$error":"#N/A"},{"$error":"#N/A"},{"$error":"#N/A"},155.9999999999997,{"$error":"#N/A"},{"$error":"#N/A"},{"$error":"#N/A"}]
[{"$nulls":5},{"$error":"#N/A"},156.19999999999968,{"$error":"#N/A"},{"$error":"#N/A"},{"$error":"#N/A"},{"$error":"#N/A"},156.19999999999968,{"$error":"#N/A"},{"$error":"#N/A"},{"$error":"#N/A"},{"$error":"#N/A"},156.19999999999968,{"$error":"#N/A"},{"$error":"#N/A"},{"$error":"#N/A"}]
[{"$nulls":5},{"$error":"#N/A"},156.39999999999966,{"$error":"#N/A"},{"$error":"#N/A"},{"$error":"#N/A"},{"$error":"#N/A"},156.39999999999966,{"$error":"#N/A"},{"$error":"#N/A"},{"$error":"#N/A"},{"$error":"#N/A"},156.39999999999966,{"$error":"#N/A"},{"$error":"#N/A"},{"$error":"#N/A"}]
[{"$nulls":5},{"$error":"#N/A"},156.59999999999965,{"$error":"#N/A"},{"$error":"#N/A"},{"$error":"#N/A"},{"$error":"#N/A"},156.59999999999965,{"$error":"#N/A"},{"$error":"#N/A"},{"$error":"#N/A"},{"$error":"#N/A"},156.59999999999965,{"$error":"#N/A"},{"$error":"#N/A"},{"$error":"#N/A"}]
[{"$nulls":5},{"$error":"#N/A"},156.79999999999964,{"$error":"#N/A"},{"$error":"#N/A"},{"$error":"#N/A"},{"$error":"#N/A"},156.79999999999964,{"$error":"#N/A"},{"$error":"#N/A"},{"$error":"#N/A"},{"$error":"#N/A"},156.79999999999964,{"$error":"#N/A"},{"$error":"#N/A"},{"$error":"#N/A"}]
[{"$nulls":5},{"$error":"#N/A"},156.99999999999963,{"$error":"#N/A"},{"$error":"#N/A"},{"$error":"#N/A"},{"$error":"#N/A"},156.99999999999963,{"$error":"#N/A"},{"$error":"#N/A"},{"$error":"#N/A"},{"$error":"#N/A"},156.99999999999963,{"$error":"#N/A"},{"$error":"#N/A"},{"$error":"#N/A"}]
[{"$nulls":5},{"$error":"#N/A"},157.19999999999962,{"$error":"#N/A"},{"$error":"#N/A"},{"$error":"#N/A"},{"$error":"#N/A"},157.19999999999962,{"$error":"#N/A"},{"$error":"#N/A"},{"$error":"#N/A"},{"$error":"#N/A"},157.19999999999962,{"$error":"#N/A"},{"$error":"#N/A"},{"$error":"#N/A"}]
[{"$nulls":5},{"$error":"#N/A"},157.3999999999996,{"$error":"#N/A"},{"$error":"#N/A"},{"$error":"#N/A"},{"$error":"#N/A"},157.3999999999996,{"$error":"#N/A"},{"$error":"#N/A"},{"$error":"#N/A"},{"$error":"#N/A"},157.3999999999996,{"$error":"#N/A"},{"$error":"#N/A"},{"$error":"#N/A"}]
[{"$nulls":5},{"$error":"#N/A"},157.5999999999996,{"$error":"#N/A"},{"$error":"#N/A"},{"$error":"#N/A"},{"$error":"#N/A"},157.5999999999996,{"$error":"#N/A"},{"$error":"#N/A"},{"$error":"#N/A"},{"$error":"#N/A"},157.5999999999996,{"$error":"#N/A"},{"$error":"#N/A"},{"$error":"#N/A"}]
[{"$nulls":5},{"$error":"#N/A"},157.79999999999959,{"$error":"#N/A"},{"$error":"#N/A"},{"$error":"#N/A"},{"$error":"#N/A"},157.79999999999959,{"$error":"#N/A"},{"$error":"#N/A"},{"$error":"#N/A"},{"$error":"#N/A"},157.79999999999959,{"$error":"#N/A"},{"$error":"#N/A"},{"$error":"#N/A"}]
[{"$nulls":5},{"$error":"#N/A"},157.99999999999957,{"$error":"#N/A"},{"$error":"#N/A"},{"$error":"#N/A"},{"$error":"#N/A"},157.99999999999957,{"$error":"#N/A"},{"$error":"#N/A"},{"$error":"#N/A"},{"$error":"#N/A"},157.99999999999957,{"$error":"#N/A"},{"$error":"#N/A"},{"$error":"#N/A"}]
[{"$nulls":5},{"$error":"#N/A"},158.19999999999956,{"$error":"#N/A"},{"$error":"#N/A"},{"$error":"#N/A"},{"$error":"#N/A"},158.19999999999956,{"$error":"#N/A"},{"$error":"#N/A"},{"$error":"#N/A"},{"$error":"#N/A"},158.19999999999956,{"$error":"#N/A"},{"$error":"#N/A"},{"$error":"#N/A"}]
[{"$nulls":5},{"$error":"#N/A"},158.39999999999955,{"$error":"#N/A"},{"$error":"#N/A"},{"$error":"#N/A"},{"$error":"#N/A"},158.39999999999955,{"$error":"#N/A"},{"$error":"#N/A"},{"$error":"#N/A"},{"$error":"#N/A"},158.39999999999955,{"$error":"#N/A"},{"$error":"#N/A"},{"$error":"#N/A"}]
[{"$nulls":5},{"$error":"#N/A"},158.59999999999954,{"$error":"#N/A"},{"$error":"#N/A"},{"$error":"#N/A"},{"$error":"#N/A"},158.59999999999954,{"$error":"#N/A"},{"$error":"#N/A"},{"$error":"#N/A"},{"$error":"#N/A"},158.59999999999954,{"$error":"#N/A"},{"$error":"#N/A"},{"$error":"#N/A"}]
[{"$nulls":5},{"$error":"#N/A"},158.79999999999953,{"$error":"#N/A"},{"$error":"#N/A"},{"$error":"#N/A"},{"$error":"#N/A"},158.79999999999953,{"$error":"#N/A"},{"$error":"#N/A"},{"$error":"#N/A"},{"$error":"#N/A"},158.79999999999953,{"$error":"#N/A"},{"$error":"#N/A"},{"$error":"#N/A"}]
[{"$nulls":5},{"$error":"#N/A"},158.99999999999952,{"$error":"#N/A"},{"$error":"#N/A"},{"$error":"#N/A"},{"$error":"#N/A"},158.99999999999952,{"$error":"#N/A"},{"$error":"#N/A"},{"$error":"#N/A"},{"$error":"#N/A"},158.99999999999952,{"$error":"#N/A"},{"$error":"#N/A"},{"$error":"#N/A"}]
[{"$nulls":5},{"$error":"#N/A"},159.1999999999995,{"$error":"#N/A"},{"$error":"#N/A"},{"$error":"#N/A"},{"$error":"#N/A"},159.1999999999995,{"$error":"#N/A"},{"$error":"#N/A"},{"$error":"#N/A"},{"$error":"#N/A"},159.1999999999995,{"$error":"#N/A"},{"$error":"#N/A"},{"$error":"#N/A"}]
[{"$nulls":5},{"$error":"#N/A"},159.3999999999995,{"$error":"#N/A"},{"$error":"#N/A"},{"$error":"#N/A"},{"$error":"#N/A"},159.3999999999995,{"$error":"#N/A"},{"$error":"#N/A"},{"$error":"#N/A"},{"$error":"#N/A"},159.3999999999995,{"$error":"#N/A"},{"$error":"#N/A"},{"$error":"#N/A"}]
[{"$nulls":5},{"$error":"#N/A"},159.59999999999948,{"$error":"#N/A"},{"$error":"#N/A"},{"$error":"#N/A"},{"$error":"#N/A"},159.59999999999948,{"$error":"#N/A"},{"$error":"#N/A"},{"$error":"#N/A"},{"$error":"#N/A"},159.59999999999948,{"$error":"#N/A"},{"$error":"#N/A"},{"$error":"#N/A"}]
[{"$nulls":5},{"$error":"#N/A"},159.79999999999947,{"$error":"#N/A"},{"$error":"#N/A"},{"$error":"#N/A"},{"$error":"#N/A"},159.79999999999947,{"$error":"#N/A"},{"$error":"#N/A"},{"$error":"#N/A"},{"$error":"#N/A"},159.79999999999947,{"$error":"#N/A"},{"$error":"#N/A"},{"$error":"#N/A"}]
[{"$nulls":5},{"$error":"#N/A"},159.99999999999946,{"$error":"#N/A"},{"$error":"#N/A"},{"$error":"#N/A"},{"$error":"#N/A"},159.99999999999946,{"$error":"#N/A"},{"$error":"#N/A"},{"$error":"#N/A"},{"$error":"#N/A"},159.99999999999946,{"$error":"#N/A"},{"$error":"#N/A"},{"$error":"#N/A"}]
[{"$nulls":5},{"$error":"#N/A"},160.19999999999945,{"$error":"#N/A"},{"$error":"#N/A"},{"$error":"#N/A"},{"$error":"#N/A"},160.19999999999945,{"$error":"#N/A"},{"$error":"#N/A"},{"$error":"#N/A"},{"$error":"#N/A"},160.19999999999945,{"$error":"#N/A"},{"$error":"#N/A"},{"$error":"#N/A"}]
[{"$nulls":5},{"$error":"#N/A"},160.39999999999944,{"$error":"#N/A"},{"$error":"#N/A"},{"$error":"#N/A"},{"$error":"#N/A"},160.39999999999944,{"$error":"#N/A"},{"$error":"#N/A"},{"$error":"#N/A"},{"$error":"#N/A"},160.39999999999944,{"$error":"#N/A"},{"$error":"#N/A"},{"$error":"#N/A"}]
[{"$nulls":5},{"$error":"#N/A"},160.59999999999943,{"$error":"#N/A"},{"$error":"#N/A"},{"$error":"#N/A"},{"$error":"#N/A"},160.59999999999943,{"$error":"#N/A"},{"$error":"#N/A"},{"$error":"#N/A"},{"$error":"#N/A"},160.59999999999943,{"$error":"#N/A"},{"$error":"#N/A"},{"$error":"#N/A"}]
[{"$nulls":5},{"$f":"IF(F806<$I$2,F806+30,NA())","v":{"$error":"#N/A"}},{"$f":"G806+$G$2","v":160.79999999999941},{"$f":"-1+COS(F807*PI()/180)+G807","v":{"$error":"#N/A"}},{"$f":"(F807/$I$2)*($D$8-$D$7)+COS(F807*PI()/180)+$D$7-1","v":{"$error":"#N/A"}},{"$f":"$J$2*SIN(F807*PI()/180)+$B$18","v":{"$error":"#N/A"}},{"$error":"#N/A"},160.79999999999941,{"$f":"-1+COS(K807*PI()/180)+L807","v":{"$error":"#N/A"}},{"$f":"(K807/$N$2)*($D$13-$D$12)+COS(K807*PI()/180)+$D$12-1","v":{"$error":"#N/A"}},{"$f":"$O$2*SIN(K807*PI()/180)+$B$19","v":{"$error":"#N/A"}},{"$error":"#N/A"},{"$f":"Q806+$G$2","v":160.79999999999941},{"$f":"-1+COS(P807*PI()/180)+Q807","v":{"$error":"#N/A"}},{"$f":"(P807/$S$2)*($D$18-$D$17)+COS(P807*PI()/180)+$D$17-1","v":{"$error":"#N/A"}},{"$f":"$T$2*SIN(P807*PI()/180)+$B$20","v":{"$error":"#N/A"}}]
[{"$nulls":5},{"$error":"#N/A"},160.9999999999994,{"$error":"#N/A"},{"$error":"#N/A"},{"$error":"#N/A"},{"$error":"#N/A"},160.9999999999994,{"$error":"#N/A"},{"$error":"#N/A"},{"$error":"#N/A"},{"$error":"#N/A"},160.9999999999994,{"$error":"#N/A"},{"$error":"#N/A"},{"$error":"#N/A"}]
[{"$nulls":5},{"$error":"#N/A"},161.1999999999994,{"$error":"#N/A"},{"$error":"#N/A"},{"$error":"#N/A"},{"$error":"#N/A"},161.1999999999994,{"$error":"#N/A"},{"$error":"#N/A"},{"$error":"#N/A"},{"$error":"#N/A"},161.1999999999994,{"$error":"#N/A"},{"$error":"#N/A"},{"$error":"#N/A"}]
[{"$nulls":5},{"$error":"#N/A"},161.39999999999938,{"$error":"#N/A"},{"$error":"#N/A"},{"$error":"#N/A"},{"$error":"#N/A"},161.39999999999938,{"$error":"#N/A"},{"$error":"#N/A"},{"$error":"#N/A"},{"$error":"#N/A"},161.39999999999938,{"$error":"#N/A"},{"$error":"#N/A"},{"$error":"#N/A"}]
[{"$nulls":5},{"$error":"#N/A"},161.59999999999937,{"$error":"#N/A"},{"$error":"#N/A"},{"$error":"#N/A"},{"$error":"#N/A"},161.59999999999937,{"$error":"#N/A"},{"$error":"#N/A"},{"$error":"#N/A"},{"$error":"#N/A"},161.59999999999937,{"$error":"#N/A"},{"$error":"#N/A"},{"$error":"#N/A"}]
[{"$nulls":5},{"$error":"#N/A"},161.79999999999936,{"$error":"#N/A"},{"$error":"#N/A"},{"$error":"#N/A"},{"$error":"#N/A"},161.79999999999936,{"$error":"#N/A"},{"$error":"#N/A"},{"$error":"#N/A"},{"$error":"#N/A"},161.79999999999936,{"$error":"#N/A"},{"$error":"#N/A"},{"$error":"#N/A"}]
[{"$nulls":5},{"$error":"#N/A"},161.99999999999935,{"$error":"#N/A"},{"$error":"#N/A"},{"$error":"#N/A"},{"$error":"#N/A"},161.99999999999935,{"$error":"#N/A"},{"$error":"#N/A"},{"$error":"#N/A"},{"$error":"#N/A"},161.99999999999935,{"$error":"#N/A"},{"$error":"#N/A"},{"$error":"#N/A"}]
[{"$nulls":5},{"$error":"#N/A"},162.19999999999933,{"$error":"#N/A"},{"$error":"#N/A"},{"$error":"#N/A"},{"$error":"#N/A"},162.19999999999933,{"$error":"#N/A"},{"$error":"#N/A"},{"$error":"#N/A"},{"$error":"#N/A"},162.19999999999933,{"$error":"#N/A"},{"$error":"#N/A"},{"$error":"#N/A"}]
[{"$nulls":5},{"$error":"#N/A"},162.39999999999932,{"$error":"#N/A"},{"$error":"#N/A"},{"$error":"#N/A"},{"$error":"#N/A"},162.39999999999932,{"$error":"#N/A"},{"$error":"#N/A"},{"$error":"#N/A"},{"$error":"#N/A"},162.39999999999932,{"$error":"#N/A"},{"$error":"#N/A"},{"$error":"#N/A"}]
[{"$nulls":5},{"$error":"#N/A"},162.5999999999993,{"$error":"#N/A"},{"$error":"#N/A"},{"$error":"#N/A"},{"$error":"#N/A"},162.5999999999993,{"$error":"#N/A"},{"$error":"#N/A"},{"$error":"#N/A"},{"$error":"#N/A"},162.5999999999993,{"$error":"#N/A"},{"$error":"#N/A"},{"$error":"#N/A"}]
[{"$nulls":5},{"$error":"#N/A"},162.7999999999993,{"$error":"#N/A"},{"$error":"#N/A"},{"$error":"#N/A"},{"$error":"#N/A"},162.7999999999993,{"$error":"#N/A"},{"$error":"#N/A"},{"$error":"#N/A"},{"$error":"#N/A"},162.7999999999993,{"$error":"#N/A"},{"$error":"#N/A"},{"$error":"#N/A"}]
[{"$nulls":5},{"$error":"#N/A"},162.9999999999993,{"$error":"#N/A"},{"$error":"#N/A"},{"$error":"#N/A"},{"$error":"#N/A"},162.9999999999993,{"$error":"#N/A"},{"$error":"#N/A"},{"$error":"#N/A"},{"$error":"#N/A"},162.9999999999993,{"$error":"#N/A"},{"$error":"#N/A"},{"$error":"#N/A"}]
[{"$nulls":5},{"$error":"#N/A"},163.19999999999928,{"$error":"#N/A"},{"$error":"#N/A"},{"$error":"#N/A"},{"$error":"#N/A"},163.19999999999928,{"$error":"#N/A"},{"$error":"#N/A"},{"$error":"#N/A"},{"$error":"#N/A"},163.19999999999928,{"$error":"#N/A"},{"$error":"#N/A"},{"$error":"#N/A"}]
[{"$nulls":5},{"$error":"#N/A"},163.39999999999927,{"$error":"#N/A"},{"$error":"#N/A"},{"$error":"#N/A"},{"$error":"#N/A"},163.39999999999927,{"$error":"#N/A"},{"$error":"#N/A"},{"$error":"#N/A"},{"$error":"#N/A"},163.39999999999927,{"$error":"#N/A"},{"$error":"#N/A"},{"$error":"#N/A"}]
[{"$nulls":5},{"$error":"#N/A"},163.59999999999926,{"$error":"#N/A"},{"$error":"#N/A"},{"$error":"#N/A"},{"$error":"#N/A"},163.59999999999926,{"$error":"#N/A"},{"$error":"#N/A"},{"$error":"#N/A"},{"$error":"#N/A"},163.59999999999926,{"$error":"#N/A"},{"$error":"#N/A"},{"$error":"#N/A"}]
[{"$nulls":5},{"$error":"#N/A"},163.79999999999924,{"$error":"#N/A"},{"$error":"#N/A"},{"$error":"#N/A"},{"$error":"#N/A"},163.79999999999924,{"$error":"#N/A"},{"$error":"#N/A"},{"$error":"#N/A"},{"$error":"#N/A"},163.79999999999924,{"$error":"#N/A"},{"$error":"#N/A"},{"$error":"#N/A"}]
[{"$nulls":5},{"$error":"#N/A"},163.99999999999923,{"$error":"#N/A"},{"$error":"#N/A"},{"$error":"#N/A"},{"$error":"#N/A"},163.99999999999923,{"$error":"#N/A"},{"$error":"#N/A"},{"$error":"#N/A"},{"$error":"#N/A"},163.99999999999923,{"$error":"#N/A"},{"$error":"#N/A"},{"$error":"#N/A"}]
[{"$nulls":5},{"$error":"#N/A"},164.19999999999922,{"$error":"#N/A"},{"$error":"#N/A"},{"$error":"#N/A"},{"$error":"#N/A"},164.19999999999922,{"$error":"#N/A"},{"$error":"#N/A"},{"$error":"#N/A"},{"$error":"#N/A"},164.19999999999922,{"$error":"#N/A"},{"$error":"#N/A"},{"$error":"#N/A"}]
[{"$nulls":5},{"$error":"#N/A"},164.3999999999992,{"$error":"#N/A"},{"$error":"#N/A"},{"$error":"#N/A"},{"$error":"#N/A"},164.3999999999992,{"$error":"#N/A"},{"$error":"#N/A"},{"$error":"#N/A"},{"$error":"#N/A"},164.3999999999992,{"$error":"#N/A"},{"$error":"#N/A"},{"$error":"#N/A"}]
[{"$nulls":5},{"$error":"#N/A"},164.5999999999992,{"$error":"#N/A"},{"$error":"#N/A"},{"$error":"#N/A"},{"$error":"#N/A"},164.5999999999992,{"$error":"#N/A"},{"$error":"#N/A"},{"$error":"#N/A"},{"$error":"#N/A"},164.5999999999992,{"$error":"#N/A"},{"$error":"#N/A"},{"$error":"#N/A"}]
[{"$nulls":5},{"$error":"#N/A"},164.7999999999992,{"$error":"#N/A"},{"$error":"#N/A"},{"$error":"#N/A"},{"$error":"#N/A"},164.7999999999992,{"$error":"#N/A"},{"$error":"#N/A"},{"$error":"#N/A"},{"$error":"#N/A"},164.7999999999992,{"$error":"#N/A"},{"$error":"#N/A"},{"$error":"#N/A"}]
[{"$nulls":5},{"$error":"#N/A"},164.99999999999918,{"$error":"#N/A"},{"$error":"#N/A"},{"$error":"#N/A"},{"$error":"#N/A"},164.99999999999918,{"$error":"#N/A"},{"$error":"#N/A"},{"$error":"#N/A"},{"$error":"#N/A"},164.99999999999918,{"$error":"#N/A"},{"$error":"#N/A"},{"$error":"#N/A"}]
[{"$nulls":5},{"$error":"#N/A"},165.19999999999916,{"$error":"#N/A"},{"$error":"#N/A"},{"$error":"#N/A"},{"$error":"#N/A"},165.19999999999916,{"$error":"#N/A"},{"$error":"#N/A"},{"$error":"#N/A"},{"$error":"#N/A"},165.19999999999916,{"$error":"#N/A"},{"$error":"#N/A"},{"$error":"#N/A"}]
[{"$nulls":5},{"$error":"#N/A"},165.39999999999915,{"$error":"#N/A"},{"$error":"#N/A"},{"$error":"#N/A"},{"$error":"#N/A"},165.39999999999915,{"$error":"#N/A"},{"$error":"#N/A"},{"$error":"#N/A"},{"$error":"#N/A"},165.39999999999915,{"$error":"#N/A"},{"$error":"#N/A"},{"$error":"#N/A"}]
[{"$nulls":5},{"$error":"#N/A"},165.59999999999914,{"$error":"#N/A"},{"$error":"#N/A"},{"$error":"#N/A"},{"$error":"#N/A"},165.59999999999914,{"$error":"#N/A"},{"$error":"#N/A"},{"$error":"#N/A"},{"$error":"#N/A"},165.59999999999914,{"$error":"#N/A"},{"$error":"#N/A"},{"$error":"#N/A"}]
[{"$nulls":5},{"$error":"#N/A"},165.79999999999913,{"$error":"#N/A"},{"$error":"#N/A"},{"$error":"#N/A"},{"$error":"#N/A"},165.79999999999913,{"$error":"#N/A"},{"$error":"#N/A"},{"$error":"#N/A"},{"$error":"#N/A"},165.79999999999913,{"$error":"#N/A"},{"$error":"#N/A"},{"$error":"#N/A"}]
[{"$nulls":5},{"$error":"#N/A"},165.99999999999912,{"$error":"#N/A"},{"$error":"#N/A"},{"$error":"#N/A"},{"$error":"#N/A"},165.99999999999912,{"$error":"#N/A"},{"$error":"#N/A"},{"$error":"#N/A"},{"$error":"#N/A"},165.99999999999912,{"$error":"#N/A"},{"$error":"#N/A"},{"$error":"#N/A"}]
[{"$nulls":5},{"$error":"#N/A"},166.1999999999991,{"$error":"#N/A"},{"$error":"#N/A"},{"$error":"#N/A"},{"$error":"#N/A"},166.1999999999991,{"$error":"#N/A"},{"$error":"#N/A"},{"$error":"#N/A"},{"$error":"#N/A"},166.1999999999991,{"$error":"#N/A"},{"$error":"#N/A"},{"$error":"#N/A"}]
[{"$nulls":5},{"$error":"#N/A"},166.3999999999991,{"$error":"#N/A"},{"$error":"#N/A"},{"$error":"#N/A"},{"$error":"#N/A"},166.3999999999991,{"$error":"#N/A"},{"$error":"#N/A"},{"$error":"#N/A"},{"$error":"#N/A"},166.3999999999991,{"$error":"#N/A"},{"$error":"#N/A"},{"$error":"#N/A"}]
[{"$nulls":5},{"$error":"#N/A"},166.59999999999908,{"$error":"#N/A"},{"$error":"#N/A"},{"$error":"#N/A"},{"$error":"#N/A"},166.59999999999908,{"$error":"#N/A"},{"$error":"#N/A"},{"$error":"#N/A"},{"$error":"#N/A"},166.59999999999908,{"$error":"#N/A"},{"$error":"#N/A"},{"$error":"#N/A"}]
[{"$nulls":5},{"$error":"#N/A"},166.79999999999907,{"$error":"#N/A"},{"$error":"#N/A"},{"$error":"#N/A"},{"$f":"IF(K836<$N$2,K836+30,NA())","v":{"$error":"#N/A"}},{"$f":"L836+$L$2","v":166.79999999999907},{"$error":"#N/A"},{"$error":"#N/A"},{"$error":"#N/A"},{"$f":"IF(P836<$S$2,P836+30,NA())","v":{"$error":"#N/A"}},166.79999999999907,{"$error":"#N/A"},{"$error":"#N/A"},{"$error":"#N/A"}]
[{"$nulls":5},{"$error":"#N/A"},166.99999999999906,{"$error":"#N/A"},{"$error":"#N/A"},{"$error":"#N/A"},{"$error":"#N/A"},166.99999999999906,{"$error":"#N/A"},{"$error":"#N/A"},{"$error":"#N/A"},{"$error":"#N/A"},166.99999999999906,{"$error":"#N/A"},{"$error":"#N/A"},{"$error":"#N/A"}]
[{"$nulls":5},{"$error":"#N/A"},167.19999999999905,{"$error":"#N/A"},{"$error":"#N/A"},{"$error":"#N/A"},{"$error":"#N/A"},167.19999999999905,{"$error":"#N/A"},{"$error":"#N/A"},{"$error":"#N/A"},{"$error":"#N/A"},167.19999999999905,{"$error":"#N/A"},{"$error":"#N/A"},{"$error":"#N/A"}]
[{"$nulls":5},{"$error":"#N/A"},167.39999999999904,{"$error":"#N/A"},{"$error":"#N/A"},{"$error":"#N/A"},{"$error":"#N/A"},167.39999999999904,{"$error":"#N/A"},{"$error":"#N/A"},{"$error":"#N/A"},{"$error":"#N/A"},167.39999999999904,{"$error":"#N/A"},{"$error":"#N/A"},{"$error":"#N/A"}]
[{"$nulls":5},{"$error":"#N/A"},167.59999999999903,{"$error":"#N/A"},{"$error":"#N/A"},{"$error":"#N/A"},{"$error":"#N/A"},167.59999999999903,{"$error":"#N/A"},{"$error":"#N/A"},{"$error":"#N/A"},{"$error":"#N/A"},167.59999999999903,{"$error":"#N/A"},{"$error":"#N/A"},{"$error":"#N/A"}]
[{"$nulls":5},{"$error":"#N/A"},167.79999999999902,{"$error":"#N/A"},{"$error":"#N/A"},{"$error":"#N/A"},{"$error":"#N/A"},167.79999999999902,{"$error":"#N/A"},{"$error":"#N/A"},{"$error":"#N/A"},{"$error":"#N/A"},167.79999999999902,{"$error":"#N/A"},{"$error":"#N/A"},{"$error":"#N/A"}]
[{"$nulls":5},{"$error":"#N/A"},167.999999999999,{"$error":"#N/A"},{"$error":"#N/A"},{"$error":"#N/A"},{"$error":"#N/A"},167.999999999999,{"$error":"#N/A"},{"$error":"#N/A"},{"$error":"#N/A"},{"$error":"#N/A"},167.999999999999,{"$error":"#N/A"},{"$error":"#N/A"},{"$error":"#N/A"}]
[{"$nulls":5},{"$error":"#N/A"},168.199999999999,{"$error":"#N/A"},{"$error":"#N/A"},{"$error":"#N/A"},{"$error":"#N/A"},168.199999999999,{"$error":"#N/A"},{"$error":"#N/A"},{"$error":"#N/A"},{"$error":"#N/A"},168.199999999999,{"$error":"#N/A"},{"$error":"#N/A"},{"$error":"#N/A"}]
[{"$nulls":5},{"$error":"#N/A"},168.39999999999898,{"$error":"#N/A"},{"$error":"#N/A"},{"$error":"#N/A"},{"$error":"#N/A"},168.39999999999898,{"$error":"#N/A"},{"$error":"#N/A"},{"$error":"#N/A"},{"$error":"#N/A"},168.39999999999898,{"$error":"#N/A"},{"$error":"#N/A"},{"$error":"#N/A"}]
[{"$nulls":5},{"$error":"#N/A"},168.59999999999897,{"$error":"#N/A"},{"$error":"#N/A"},{"$error":"#N/A"},{"$error":"#N/A"},168.59999999999897,{"$error":"#N/A"},{"$error":"#N/A"},{"$error":"#N/A"},{"$error":"#N/A"},168.59999999999897,{"$error":"#N/A"},{"$error":"#N/A"},{"$error":"#N/A"}]
[{"$nulls":5},{"$error":"#N/A"},168.79999999999896,{"$error":"#N/A"},{"$error":"#N/A"},{"$error":"#N/A"},{"$error":"#N/A"},168.79999999999896,{"$error":"#N/A"},{"$error":"#N/A"},{"$error":"#N/A"},{"$error":"#N/A"},168.79999999999896,{"$error":"#N/A"},{"$error":"#N/A"},{"$error":"#N/A"}]
[{"$nulls":5},{"$error":"#N/A"},168.99999999999895,{"$error":"#N/A"},{"$error":"#N/A"},{"$error":"#N/A"},{"$error":"#N/A"},168.99999999999895,{"$error":"#N/A"},{"$error":"#N/A"},{"$error":"#N/A"},{"$error":"#N/A"},168.99999999999895,{"$error":"#N/A"},{"$error":"#N/A"},{"$error":"#N/A"}]
[{"$nulls":5},{"$error":"#N/A"},169.19999999999894,{"$error":"#N/A"},{"$error":"#N/A"},{"$error":"#N/A"},{"$error":"#N/A"},169.19999999999894,{"$error":"#N/A"},{"$error":"#N/A"},{"$error":"#N/A"},{"$error":"#N/A"},169.19999999999894,{"$error":"#N/A"},{"$error":"#N/A"},{"$error":"#N/A"}]
[{"$nulls":5},{"$error":"#N/A"},169.39999999999893,{"$error":"#N/A"},{"$error":"#N/A"},{"$error":"#N/A"},{"$error":"#N/A"},169.39999999999893,{"$error":"#N/A"},{"$error":"#N/A"},{"$error":"#N/A"},{"$error":"#N/A"},169.39999999999893,{"$error":"#N/A"},{"$error":"#N/A"},{"$error":"#N/A"}]
[{"$nulls":5},{"$error":"#N/A"},169.59999999999891,{"$error":"#N/A"},{"$error":"#N/A"},{"$error":"#N/A"},{"$error":"#N/A"},169.59999999999891,{"$error":"#N/A"},{"$error":"#N/A"},{"$error":"#N/A"},{"$error":"#N/A"},169.59999999999891,{"$error":"#N/A"},{"$error":"#N/A"},{"$error":"#N/A"}]
[{"$nulls":5},{"$error":"#N/A"},169.7999999999989,{"$error":"#N/A"},{"$error":"#N/A"},{"$error":"#N/A"},{"$error":"#N/A"},169.7999999999989,{"$error":"#N/A"},{"$error":"#N/A"},{"$error":"#N/A"},{"$error":"#N/A"},169.7999999999989,{"$error":"#N/A"},{"$error":"#N/A"},{"$error":"#N/A"}]
[{"$nulls":5},{"$error":"#N/A"},169.9999999999989,{"$error":"#N/A"},{"$error":"#N/A"},{"$error":"#N/A"},{"$error":"#N/A"},169.9999999999989,{"$error":"#N/A"},{"$error":"#N/A"},{"$error":"#N/A"},{"$error":"#N/A"},169.9999999999989,{"$error":"#N/A"},{"$error":"#N/A"},{"$error":"#N/A"}]
[{"$nulls":5},{"$error":"#N/A"},170.19999999999888,{"$error":"#N/A"},{"$error":"#N/A"},{"$error":"#N/A"},{"$error":"#N/A"},170.19999999999888,{"$error":"#N/A"},{"$error":"#N/A"},{"$error":"#N/A"},{"$error":"#N/A"},170.19999999999888,{"$error":"#N/A"},{"$error":"#N/A"},{"$error":"#N/A"}]
[{"$nulls":5},{"$error":"#N/A"},170.39999999999887,{"$error":"#N/A"},{"$error":"#N/A"},{"$error":"#N/A"},{"$error":"#N/A"},170.39999999999887,{"$error":"#N/A"},{"$error":"#N/A"},{"$error":"#N/A"},{"$error":"#N/A"},170.39999999999887,{"$error":"#N/A"},{"$error":"#N/A"},{"$error":"#N/A"}]
[{"$nulls":5},{"$error":"#N/A"},170.59999999999886,{"$error":"#N/A"},{"$error":"#N/A"},{"$error":"#N/A"},{"$error":"#N/A"},170.59999999999886,{"$error":"#N/A"},{"$error":"#N/A"},{"$error":"#N/A"},{"$error":"#N/A"},170.59999999999886,{"$error":"#N/A"},{"$error":"#N/A"},{"$error":"#N/A"}]
[{"$nulls":5},{"$error":"#N/A"},170.79999999999885,{"$error":"#N/A"},{"$error":"#N/A"},{"$error":"#N/A"},{"$error":"#N/A"},170.79999999999885,{"$error":"#N/A"},{"$error":"#N/A"},{"$error":"#N/A"},{"$error":"#N/A"},170.79999999999885,{"$error":"#N/A"},{"$error":"#N/A"},{"$error":"#N/A"}]
[{"$nulls":5},{"$error":"#N/A"},170.99999999999883,{"$error":"#N/A"},{"$error":"#N/A"},{"$error":"#N/A"},{"$error":"#N/A"},170.99999999999883,{"$error":"#N/A"},{"$error":"#N/A"},{"$error":"#N/A"},{"$error":"#N/A"},170.99999999999883,{"$error":"#N/A"},{"$error":"#N/A"},{"$error":"#N/A"}]
[{"$nulls":5},{"$error":"#N/A"},171.19999999999882,{"$error":"#N/A"},{"$error":"#N/A"},{"$error":"#N/A"},{"$error":"#N/A"},171.19999999999882,{"$error":"#N/A"},{"$error":"#N/A"},{"$error":"#N/A"},{"$error":"#N/A"},171.19999999999882,{"$error":"#N/A"},{"$error":"#N/A"},{"$error":"#N/A"}]
[{"$nulls":5},{"$error":"#N/A"},171.3999999999988,{"$error":"#N/A"},{"$error":"#N/A"},{"$error":"#N/A"},{"$error":"#N/A"},171.3999999999988,{"$error":"#N/A"},{"$error":"#N/A"},{"$error":"#N/A"},{"$error":"#N/A"},171.3999999999988,{"$error":"#N/A"},{"$error":"#N/A"},{"$error":"#N/A"}]
[{"$nulls":5},{"$error":"#N/A"},171.5999999999988,{"$error":"#N/A"},{"$error":"#N/A"},{"$error":"#N/A"},{"$error":"#N/A"},171.5999999999988,{"$error":"#N/A"},{"$error":"#N/A"},{"$error":"#N/A"},{"$error":"#N/A"},171.5999999999988,{"$error":"#N/A"},{"$error":"#N/A"},{"$error":"#N/A"}]
[{"$nulls":5},{"$error":"#N/A"},171.7999999999988,{"$error":"#N/A"},{"$error":"#N/A"},{"$error":"#N/A"},{"$error":"#N/A"},171.7999999999988,{"$error":"#N/A"},{"$error":"#N/A"},{"$error":"#N/A"},{"$error":"#N/A"},171.7999999999988,{"$error":"#N/A"},{"$error":"#N/A"},{"$error":"#N/A"}]
[{"$nulls":5},{"$error":"#N/A"},171.99999999999878,{"$error":"#N/A"},{"$error":"#N/A"},{"$error":"#N/A"},{"$error":"#N/A"},171.99999999999878,{"$error":"#N/A"},{"$error":"#N/A"},{"$error":"#N/A"},{"$error":"#N/A"},171.99999999999878,{"$error":"#N/A"},{"$error":"#N/A"},{"$error":"#N/A"}]
[{"$nulls":5},{"$error":"#N/A"},172.19999999999877,{"$error":"#N/A"},{"$error":"#N/A"},{"$error":"#N/A"},{"$error":"#N/A"},172.19999999999877,{"$error":"#N/A"},{"$error":"#N/A"},{"$error":"#N/A"},{"$error":"#N/A"},172.19999999999877,{"$error":"#N/A"},{"$error":"#N/A"},{"$error":"#N/A"}]
[{"$nulls":5},{"$error":"#N/A"},172.39999999999876,{"$error":"#N/A"},{"$error":"#N/A"},{"$error":"#N/A"},{"$error":"#N/A"},172.39999999999876,{"$error":"#N/A"},{"$error":"#N/A"},{"$error":"#N/A"},{"$error":"#N/A"},172.39999999999876,{"$error":"#N/A"},{"$error":"#N/A"},{"$error":"#N/A"}]
[{"$nulls":5},{"$error":"#N/A"},172.59999999999874,{"$error":"#N/A"},{"$error":"#N/A"},{"$error":"#N/A"},{"$error":"#N/A"},172.59999999999874,{"$error":"#N/A"},{"$error":"#N/A"},{"$error":"#N/A"},{"$error":"#N/A"},172.59999999999874,{"$error":"#N/A"},{"$error":"#N/A"},{"$error":"#N/A"}]
[{"$nulls":5},{"$error":"#N/A"},172.79999999999873,{"$error":"#N/A"},{"$error":"#N/A"},{"$error":"#N/A"},{"$error":"#N/A"},172.79999999999873,{"$error":"#N/A"},{"$error":"#N/A"},{"$error":"#N/A"},{"$error":"#N/A"},172.79999999999873,{"$error":"#N/A"},{"$error":"#N/A"},{"$error":"#N/A"}]
[{"$nulls":5},{"$error":"#N/A"},172.99999999999872,{"$error":"#N/A"},{"$error":"#N/A"},{"$error":"#N/A"},{"$error":"#N/A"},172.99999999999872,{"$error":"#N/A"},{"$error":"#N/A"},{"$error":"#N/A"},{"$error":"#N/A"},172.99999999999872,{"$error":"#N/A"},{"$error":"#N/A"},{"$error":"#N/A"}]
[{"$nulls":5},{"$error":"#N/A"},173.1999999999987,{"$error":"#N/A"},{"$error":"#N/A"},{"$error":"#N/A"},{"$error":"#N/A"},173.1999999999987,{"$error":"#N/A"},{"$error":"#N/A"},{"$error":"#N/A"},{"$error":"#N/A"},173.1999999999987,{"$error":"#N/A"},{"$error":"#N/A"},{"$error":"#N/A"}]
[{"$nulls":5},{"$error":"#N/A"},173.3999999999987,{"$error":"#N/A"},{"$error":"#N/A"},{"$error":"#N/A"},{"$error":"#N/A"},173.3999999999987,{"$error":"#N/A"},{"$error":"#N/A"},{"$error":"#N/A"},{"$error":"#N/A"},173.3999999999987,{"$error":"#N/A"},{"$error":"#N/A"},{"$error":"#N/A"}]
[{"$nulls":5},{"$f":"IF(F870<$I$2,F870+30,NA())","v":{"$error":"#N/A"}},{"$f":"G870+$G$2","v":173.5999999999987},{"$f":"-1+COS(F871*PI()/180)+G871","v":{"$error":"#N/A"}},{"$f":"(F871/$I$2)*($D$8-$D$7)+COS(F871*PI()/180)+$D$7-1","v":{"$error":"#N/A"}},{"$f":"$J$2*SIN(F871*PI()/180)+$B$18","v":{"$error":"#N/A"}},{"$error":"#N/A"},173.5999999999987,{"$f":"-1+COS(K871*PI()/180)+L871","v":{"$error":"#N/A"}},{"$f":"(K871/$N$2)*($D$13-$D$12)+COS(K871*PI()/180)+$D$12-1","v":{"$error":"#N/A"}},{"$f":"$O$2*SIN(K871*PI()/180)+$B$19","v":{"$error":"#N/A"}},{"$error":"#N/A"},{"$f":"Q870+$G$2","v":173.5999999999987},{"$f":"-1+COS(P871*PI()/180)+Q871","v":{"$error":"#N/A"}},{"$f":"(P871/$S$2)*($D$18-$D$17)+COS(P871*PI()/180)+$D$17-1","v":{"$error":"#N/A"}},{"$f":"$T$2*SIN(P871*PI()/180)+$B$20","v":{"$error":"#N/A"}}]
[{"$nulls":5},{"$error":"#N/A"},173.79999999999868,{"$error":"#N/A"},{"$error":"#N/A"},{"$error":"#N/A"},{"$error":"#N/A"},173.79999999999868,{"$error":"#N/A"},{"$error":"#N/A"},{"$error":"#N/A"},{"$error":"#N/A"},173.79999999999868,{"$error":"#N/A"},{"$error":"#N/A"},{"$error":"#N/A"}]
[{"$nulls":5},{"$error":"#N/A"},173.99999999999866,{"$error":"#N/A"},{"$error":"#N/A"},{"$error":"#N/A"},{"$error":"#N/A"},173.99999999999866,{"$error":"#N/A"},{"$error":"#N/A"},{"$error":"#N/A"},{"$error":"#N/A"},173.99999999999866,{"$error":"#N/A"},{"$error":"#N/A"},{"$error":"#N/A"}]
[{"$nulls":5},{"$error":"#N/A"},174.19999999999865,{"$error":"#N/A"},{"$error":"#N/A"},{"$error":"#N/A"},{"$error":"#N/A"},174.19999999999865,{"$error":"#N/A"},{"$error":"#N/A"},{"$error":"#N/A"},{"$error":"#N/A"},174.19999999999865,{"$error":"#N/A"},{"$error":"#N/A"},{"$error":"#N/A"}]
[{"$nulls":5},{"$error":"#N/A"},174.39999999999864,{"$error":"#N/A"},{"$error":"#N/A"},{"$error":"#N/A"},{"$error":"#N/A"},174.39999999999864,{"$error":"#N/A"},{"$error":"#N/A"},{"$error":"#N/A"},{"$error":"#N/A"},174.39999999999864,{"$error":"#N/A"},{"$error":"#N/A"},{"$error":"#N/A"}]
[{"$nulls":5},{"$error":"#N/A"},174.59999999999863,{"$error":"#N/A"},{"$error":"#N/A"},{"$error":"#N/A"},{"$error":"#N/A"},174.59999999999863,{"$error":"#N/A"},{"$error":"#N/A"},{"$error":"#N/A"},{"$error":"#N/A"},174.59999999999863,{"$error":"#N/A"},{"$error":"#N/A"},{"$error":"#N/A"}]
[{"$nulls":5},{"$error":"#N/A"},174.79999999999862,{"$error":"#N/A"},{"$error":"#N/A"},{"$error":"#N/A"},{"$error":"#N/A"},174.79999999999862,{"$error":"#N/A"},{"$error":"#N/A"},{"$error":"#N/A"},{"$error":"#N/A"},174.79999999999862,{"$error":"#N/A"},{"$error":"#N/A"},{"$error":"#N/A"}]
[{"$nulls":5},{"$error":"#N/A"},174.9999999999986,{"$error":"#N/A"},{"$error":"#N/A"},{"$error":"#N/A"},{"$error":"#N/A"},174.9999999999986,{"$error":"#N/A"},{"$error":"#N/A"},{"$error":"#N/A"},{"$error":"#N/A"},174.9999999999986,{"$error":"#N/A"},{"$error":"#N/A"},{"$error":"#N/A"}]
[{"$nulls":5},{"$error":"#N/A"},175.1999999999986,{"$error":"#N/A"},{"$error":"#N/A"},{"$error":"#N/A"},{"$error":"#N/A"},175.1999999999986,{"$error":"#N/A"},{"$error":"#N/A"},{"$error":"#N/A"},{"$error":"#N/A"},175.1999999999986,{"$error":"#N/A"},{"$error":"#N/A"},{"$error":"#N/A"}]
[{"$nulls":5},{"$error":"#N/A"},175.39999999999858,{"$error":"#N/A"},{"$error":"#N/A"},{"$error":"#N/A"},{"$error":"#N/A"},175.39999999999858,{"$error":"#N/A"},{"$error":"#N/A"},{"$error":"#N/A"},{"$error":"#N/A"},175.39999999999858,{"$error":"#N/A"},{"$error":"#N/A"},{"$error":"#N/A"}]
[{"$nulls":5},{"$error":"#N/A"},175.59999999999857,{"$error":"#N/A"},{"$error":"#N/A"},{"$error":"#N/A"},{"$error":"#N/A"},175.59999999999857,{"$error":"#N/A"},{"$error":"#N/A"},{"$error":"#N/A"},{"$error":"#N/A"},175.59999999999857,{"$error":"#N/A"},{"$error":"#N/A"},{"$error":"#N/A"}]
[{"$nulls":5},{"$error":"#N/A"},175.79999999999856,{"$error":"#N/A"},{"$error":"#N/A"},{"$error":"#N/A"},{"$error":"#N/A"},175.79999999999856,{"$error":"#N/A"},{"$error":"#N/A"},{"$error":"#N/A"},{"$error":"#N/A"},175.79999999999856,{"$error":"#N/A"},{"$error":"#N/A"},{"$error":"#N/A"}]
[{"$nulls":5},{"$error":"#N/A"},175.99999999999855,{"$error":"#N/A"},{"$error":"#N/A"},{"$error":"#N/A"},{"$error":"#N/A"},175.99999999999855,{"$error":"#N/A"},{"$error":"#N/A"},{"$error":"#N/A"},{"$error":"#N/A"},175.99999999999855,{"$error":"#N/A"},{"$error":"#N/A"},{"$error":"#N/A"}]
[{"$nulls":5},{"$error":"#N/A"},176.19999999999854,{"$error":"#N/A"},{"$error":"#N/A"},{"$error":"#N/A"},{"$error":"#N/A"},176.19999999999854,{"$error":"#N/A"},{"$error":"#N/A"},{"$error":"#N/A"},{"$error":"#N/A"},176.19999999999854,{"$error":"#N/A"},{"$error":"#N/A"},{"$error":"#N/A"}]
[{"$nulls":5},{"$error":"#N/A"},176.39999999999853,{"$error":"#N/A"},{"$error":"#N/A"},{"$error":"#N/A"},{"$error":"#N/A"},176.39999999999853,{"$error":"#N/A"},{"$error":"#N/A"},{"$error":"#N/A"},{"$error":"#N/A"},176.39999999999853,{"$error":"#N/A"},{"$error":"#N/A"},{"$error":"#N/A"}]
[{"$nulls":5},{"$error":"#N/A"},176.59999999999852,{"$error":"#N/A"},{"$error":"#N/A"},{"$error":"#N/A"},{"$error":"#N/A"},176.59999999999852,{"$error":"#N/A"},{"$error":"#N/A"},{"$error":"#N/A"},{"$error":"#N/A"},176.59999999999852,{"$error":"#N/A"},{"$error":"#N/A"},{"$error":"#N/A"}]
[{"$nulls":5},{"$error":"#N/A"},176.7999999999985,{"$error":"#N/A"},{"$error":"#N/A"},{"$error":"#N/A"},{"$error":"#N/A"},176.7999999999985,{"$error":"#N/A"},{"$error":"#N/A"},{"$error":"#N/A"},{"$error":"#N/A"},176.7999999999985,{"$error":"#N/A"},{"$error":"#N/A"},{"$error":"#N/A"}]
[{"$nulls":5},{"$error":"#N/A"},176.9999999999985,{"$error":"#N/A"},{"$error":"#N/A"},{"$error":"#N/A"},{"$error":"#N/A"},176.9999999999985,{"$error":"#N/A"},{"$error":"#N/A"},{"$error":"#N/A"},{"$error":"#N/A"},176.9999999999985,{"$error":"#N/A"},{"$error":"#N/A"},{"$error":"#N/A"}]
[{"$nulls":5},{"$error":"#N/A"},177.19999999999848,{"$error":"#N/A"},{"$error":"#N/A"},{"$error":"#N/A"},{"$error":"#N/A"},177.19999999999848,{"$error":"#N/A"},{"$error":"#N/A"},{"$error":"#N/A"},{"$error":"#N/A"},177.19999999999848,{"$error":"#N/A"},{"$error":"#N/A"},{"$error":"#N/A"}]
[{"$nulls":5},{"$error":"#N/A"},177.39999999999847,{"$error":"#N/A"},{"$error":"#N/A"},{"$error":"#N/A"},{"$error":"#N/A"},177.39999999999847,{"$error":"#N/A"},{"$error":"#N/A"},{"$error":"#N/A"},{"$error":"#N/A"},177.39999999999847,{"$error":"#N/A"},{"$error":"#N/A"},{"$error":"#N/A"}]
[{"$nulls":5},{"$error":"#N/A"},177.59999999999846,{"$error":"#N/A"},{"$error":"#N/A"},{"$error":"#N/A"},{"$error":"#N/A"},177.59999999999846,{"$error":"#N/A"},{"$error":"#N/A"},{"$error":"#N/A"},{"$error":"#N/A"},177.59999999999846,{"$error":"#N/A"},{"$error":"#N/A"},{"$error":"#N/A"}]
[{"$nulls":5},{"$error":"#N/A"},177.79999999999845,{"$error":"#N/A"},{"$error":"#N/A"},{"$error":"#N/A"},{"$error":"#N/A"},177.79999999999845,{"$error":"#N/A"},{"$error":"#N/A"},{"$error":"#N/A"},{"$error":"#N/A"},177.79999999999845,{"$error":"#N/A"},{"$error":"#N/A"},{"$error":"#N/A"}]
[{"$nulls":5},{"$error":"#N/A"},177.99999999999844,{"$error":"#N/A"},{"$error":"#N/A"},{"$error":"#N/A"},{"$error":"#N/A"},177.99999999999844,{"$error":"#N/A"},{"$error":"#N/A"},{"$error":"#N/A"},{"$error":"#N/A"},177.99999999999844,{"$error":"#N/A"},{"$error":"#N/A"},{"$error":"#N/A"}]
[{"$nulls":5},{"$error":"#N/A"},178.19999999999843,{"$error":"#N/A"},{"$error":"#N/A"},{"$error":"#N/A"},{"$error":"#N/A"},178.19999999999843,{"$error":"#N/A"},{"$error":"#N/A"},{"$error":"#N/A"},{"$error":"#N/A"},178.19999999999843,{"$error":"#N/A"},{"$error":"#N/A"},{"$error":"#N/A"}]
[{"$nulls":5},{"$error":"#N/A"},178.3999999999984,{"$error":"#N/A"},{"$error":"#N/A"},{"$error":"#N/A"},{"$error":"#N/A"},178.3999999999984,{"$error":"#N/A"},{"$error":"#N/A"},{"$error":"#N/A"},{"$error":"#N/A"},178.3999999999984,{"$error":"#N/A"},{"$error":"#N/A"},{"$error":"#N/A"}]
[{"$nulls":5},{"$error":"#N/A"},178.5999999999984,{"$error":"#N/A"},{"$error":"#N/A"},{"$error":"#N/A"},{"$error":"#N/A"},178.5999999999984,{"$error":"#N/A"},{"$error":"#N/A"},{"$error":"#N/A"},{"$error":"#N/A"},178.5999999999984,{"$error":"#N/A"},{"$error":"#N/A"},{"$error":"#N/A"}]
[{"$nulls":5},{"$error":"#N/A"},178.7999999999984,{"$error":"#N/A"},{"$error":"#N/A"},{"$error":"#N/A"},{"$error":"#N/A"},178.7999999999984,{"$error":"#N/A"},{"$error":"#N/A"},{"$error":"#N/A"},{"$error":"#N/A"},178.7999999999984,{"$error":"#N/A"},{"$error":"#N/A"},{"$error":"#N/A"}]
[{"$nulls":5},{"$error":"#N/A"},178.99999999999838,{"$error":"#N/A"},{"$error":"#N/A"},{"$error":"#N/A"},{"$error":"#N/A"},178.99999999999838,{"$error":"#N/A"},{"$error":"#N/A"},{"$error":"#N/A"},{"$error":"#N/A"},178.99999999999838,{"$error":"#N/A"},{"$error":"#N/A"},{"$error":"#N/A"}]
[{"$nulls":5},{"$error":"#N/A"},179.19999999999837,{"$error":"#N/A"},{"$error":"#N/A"},{"$error":"#N/A"},{"$error":"#N/A"},179.19999999999837,{"$error":"#N/A"},{"$error":"#N/A"},{"$error":"#N/A"},{"$error":"#N/A"},179.19999999999837,{"$error":"#N/A"},{"$error":"#N/A"},{"$error":"#N/A"}]
[{"$nulls":5},{"$error":"#N/A"},179.39999999999836,{"$error":"#N/A"},{"$error":"#N/A"},{"$error":"#N/A"},{"$error":"#N/A"},179.39999999999836,{"$error":"#N/A"},{"$error":"#N/A"},{"$error":"#N/A"},{"$error":"#N/A"},179.39999999999836,{"$error":"#N/A"},{"$error":"#N/A"},{"$error":"#N/A"}]
[{"$nulls":5},{"$error":"#N/A"},179.59999999999835,{"$error":"#N/A"},{"$error":"#N/A"},{"$error":"#N/A"},{"$f":"IF(K900<$N$2,K900+30,NA())","v":{"$error":"#N/A"}},{"$f":"L900+$L$2","v":179.59999999999835},{"$error":"#N/A"},{"$error":"#N/A"},{"$error":"#N/A"},{"$f":"IF(P900<$S$2,P900+30,NA())","v":{"$error":"#N/A"}},179.59999999999835,{"$error":"#N/A"},{"$error":"#N/A"},{"$error":"#N/A"}]
[{"$nulls":5},{"$error":"#N/A"},179.79999999999833,{"$error":"#N/A"},{"$error":"#N/A"},{"$error":"#N/A"},{"$error":"#N/A"},179.79999999999833,{"$error":"#N/A"},{"$error":"#N/A"},{"$error":"#N/A"},{"$error":"#N/A"},179.79999999999833,{"$error":"#N/A"},{"$error":"#N/A"},{"$error":"#N/A"}]
[{"$nulls":5},{"$error":"#N/A"},179.99999999999832,{"$error":"#N/A"},{"$error":"#N/A"},{"$error":"#N/A"},{"$error":"#N/A"},179.99999999999832,{"$error":"#N/A"},{"$error":"#N/A"},{"$error":"#N/A"},{"$error":"#N/A"},179.99999999999832,{"$error":"#N/A"},{"$error":"#N/A"},{"$error":"#N/A"}]
[{"$nulls":5},{"$error":"#N/A"},180.1999999999983,{"$error":"#N/A"},{"$error":"#N/A"},{"$error":"#N/A"},{"$error":"#N/A"},180.1999999999983,{"$error":"#N/A"},{"$error":"#N/A"},{"$error":"#N/A"},{"$error":"#N/A"},180.1999999999983,{"$error":"#N/A"},{"$error":"#N/A"},{"$error":"#N/A"}]
[{"$nulls":5},{"$error":"#N/A"},180.3999999999983,{"$error":"#N/A"},{"$error":"#N/A"},{"$error":"#N/A"},{"$error":"#N/A"},180.3999999999983,{"$error":"#N/A"},{"$error":"#N/A"},{"$error":"#N/A"},{"$error":"#N/A"},180.3999999999983,{"$error":"#N/A"},{"$error":"#N/A"},{"$error":"#N/A"}]
[{"$nulls":5},{"$error":"#N/A"},180.5999999999983,{"$error":"#N/A"},{"$error":"#N/A"},{"$error":"#N/A"},{"$error":"#N/A"},180.5999999999983,{"$error":"#N/A"},{"$error":"#N/A"},{"$error":"#N/A"},{"$error":"#N/A"},180.5999999999983,{"$error":"#N/A"},{"$error":"#N/A"},{"$error":"#N/A"}]
[{"$nulls":5},{"$error":"#N/A"},180.79999999999828,{"$error":"#N/A"},{"$error":"#N/A"},{"$error":"#N/A"},{"$error":"#N/A"},180.79999999999828,{"$error":"#N/A"},{"$error":"#N/A"},{"$error":"#N/A"},{"$error":"#N/A"},180.79999999999828,{"$error":"#N/A"},{"$error":"#N/A"},{"$error":"#N/A"}]
[{"$nulls":5},{"$error":"#N/A"},180.99999999999827,{"$error":"#N/A"},{"$error":"#N/A"},{"$error":"#N/A"},{"$error":"#N/A"},180.99999999999827,{"$error":"#N/A"},{"$error":"#N/A"},{"$error":"#N/A"},{"$error":"#N/A"},180.99999999999827,{"$error":"#N/A"},{"$error":"#N/A"},{"$error":"#N/A"}]
[{"$nulls":5},{"$error":"#N/A"},181.19999999999825,{"$error":"#N/A"},{"$error":"#N/A"},{"$error":"#N/A"},{"$error":"#N/A"},181.19999999999825,{"$error":"#N/A"},{"$error":"#N/A"},{"$error":"#N/A"},{"$error":"#N/A"},181.19999999999825,{"$error":"#N/A"},{"$error":"#N/A"},{"$error":"#N/A"}]
[{"$nulls":5},{"$error":"#N/A"},181.39999999999824,{"$error":"#N/A"},{"$error":"#N/A"},{"$error":"#N/A"},{"$error":"#N/A"},181.39999999999824,{"$error":"#N/A"},{"$error":"#N/A"},{"$error":"#N/A"},{"$error":"#N/A"},181.39999999999824,{"$error":"#N/A"},{"$error":"#N/A"},{"$error":"#N/A"}]
[{"$nulls":5},{"$error":"#N/A"},181.59999999999823,{"$error":"#N/A"},{"$error":"#N/A"},{"$error":"#N/A"},{"$error":"#N/A"},181.59999999999823,{"$error":"#N/A"},{"$error":"#N/A"},{"$error":"#N/A"},{"$error":"#N/A"},181.59999999999823,{"$error":"#N/A"},{"$error":"#N/A"},{"$error":"#N/A"}]
[{"$nulls":5},{"$error":"#N/A"},181.79999999999822,{"$error":"#N/A"},{"$error":"#N/A"},{"$error":"#N/A"},{"$error":"#N/A"},181.79999999999822,{"$error":"#N/A"},{"$error":"#N/A"},{"$error":"#N/A"},{"$error":"#N/A"},181.79999999999822,{"$error":"#N/A"},{"$error":"#N/A"},{"$error":"#N/A"}]
[{"$nulls":5},{"$error":"#N/A"},181.9999999999982,{"$error":"#N/A"},{"$error":"#N/A"},{"$error":"#N/A"},{"$error":"#N/A"},181.9999999999982,{"$error":"#N/A"},{"$error":"#N/A"},{"$error":"#N/A"},{"$error":"#N/A"},181.9999999999982,{"$error":"#N/A"},{"$error":"#N/A"},{"$error":"#N/A"}]
[{"$nulls":5},{"$error":"#N/A"},182.1999999999982,{"$error":"#N/A"},{"$error":"#N/A"},{"$error":"#N/A"},{"$error":"#N/A"},182.1999999999982,{"$error":"#N/A"},{"$error":"#N/A"},{"$error":"#N/A"},{"$error":"#N/A"},182.1999999999982,{"$error":"#N/A"},{"$error":"#N/A"},{"$error":"#N/A"}]
[{"$nulls":5},{"$error":"#N/A"},182.3999999999982,{"$error":"#N/A"},{"$error":"#N/A"},{"$error":"#N/A"},{"$error":"#N/A"},182.3999999999982,{"$error":"#N/A"},{"$error":"#N/A"},{"$error":"#N/A"},{"$error":"#N/A"},182.3999999999982,{"$error":"#N/A"},{"$error":"#N/A"},{"$error":"#N/A"}]
[{"$nulls":5},{"$error":"#N/A"},182.59999999999818,{"$error":"#N/A"},{"$error":"#N/A"},{"$error":"#N/A"},{"$error":"#N/A"},182.59999999999818,{"$error":"#N/A"},{"$error":"#N/A"},{"$error":"#N/A"},{"$error":"#N/A"},182.59999999999818,{"$error":"#N/A"},{"$error":"#N/A"},{"$error":"#N/A"}]
[{"$nulls":5},{"$error":"#N/A"},182.79999999999816,{"$error":"#N/A"},{"$error":"#N/A"},{"$error":"#N/A"},{"$error":"#N/A"},182.79999999999816,{"$error":"#N/A"},{"$error":"#N/A"},{"$error":"#N/A"},{"$error":"#N/A"},182.79999999999816,{"$error":"#N/A"},{"$error":"#N/A"},{"$error":"#N/A"}]
[{"$nulls":5},{"$error":"#N/A"},182.99999999999815,{"$error":"#N/A"},{"$error":"#N/A"},{"$error":"#N/A"},{"$error":"#N/A"},182.99999999999815,{"$error":"#N/A"},{"$error":"#N/A"},{"$error":"#N/A"},{"$error":"#N/A"},182.99999999999815,{"$error":"#N/A"},{"$error":"#N/A"},{"$error":"#N/A"}]
[{"$nulls":5},{"$error":"#N/A"},183.19999999999814,{"$error":"#N/A"},{"$error":"#N/A"},{"$error":"#N/A"},{"$error":"#N/A"},183.19999999999814,{"$error":"#N/A"},{"$error":"#N/A"},{"$error":"#N/A"},{"$error":"#N/A"},183.19999999999814,{"$error":"#N/A"},{"$error":"#N/A"},{"$error":"#N/A"}]
[{"$nulls":5},{"$error":"#N/A"},183.39999999999813,{"$error":"#N/A"},{"$error":"#N/A"},{"$error":"#N/A"},{"$error":"#N/A"},183.39999999999813,{"$error":"#N/A"},{"$error":"#N/A"},{"$error":"#N/A"},{"$error":"#N/A"},183.39999999999813,{"$error":"#N/A"},{"$error":"#N/A"},{"$error":"#N/A"}]
[{"$nulls":5},{"$error":"#N/A"},183.59999999999812,{"$error":"#N/A"},{"$error":"#N/A"},{"$error":"#N/A"},{"$error":"#N/A"},183.59999999999812,{"$error":"#N/A"},{"$error":"#N/A"},{"$error":"#N/A"},{"$error":"#N/A"},183.59999999999812,{"$error":"#N/A"},{"$error":"#N/A"},{"$error":"#N/A"}]
[{"$nulls":5},{"$error":"#N/A"},183.7999999999981,{"$error":"#N/A"},{"$error":"#N/A"},{"$error":"#N/A"},{"$error":"#N/A"},183.7999999999981,{"$error":"#N/A"},{"$error":"#N/A"},{"$error":"#N/A"},{"$error":"#N/A"},183.7999999999981,{"$error":"#N/A"},{"$error":"#N/A"},{"$error":"#N/A"}]
[{"$nulls":5},{"$error":"#N/A"},183.9999999999981,{"$error":"#N/A"},{"$error":"#N/A"},{"$error":"#N/A"},{"$error":"#N/A"},183.9999999999981,{"$error":"#N/A"},{"$error":"#N/A"},{"$error":"#N/A"},{"$error":"#N/A"},183.9999999999981,{"$error":"#N/A"},{"$error":"#N/A"},{"$error":"#N/A"}]
[{"$nulls":5},{"$error":"#N/A"},184.19999999999808,{"$error":"#N/A"},{"$error":"#N/A"},{"$error":"#N/A"},{"$error":"#N/A"},184.19999999999808,{"$error":"#N/A"},{"$error":"#N/A"},{"$error":"#N/A"},{"$error":"#N/A"},184.19999999999808,{"$error":"#N/A"},{"$error":"#N/A"},{"$error":"#N/A"}]
[{"$nulls":5},{"$error":"#N/A"},184.39999999999807,{"$error":"#N/A"},{"$error":"#N/A"},{"$error":"#N/A"},{"$error":"#N/A"},184.39999999999807,{"$error":"#N/A"},{"$error":"#N/A"},{"$error":"#N/A"},{"$error":"#N/A"},184.39999999999807,{"$error":"#N/A"},{"$error":"#N/A"},{"$error":"#N/A"}]
[{"$nulls":5},{"$error":"#N/A"},184.59999999999806,{"$error":"#N/A"},{"$error":"#N/A"},{"$error":"#N/A"},{"$error":"#N/A"},184.59999999999806,{"$error":"#N/A"},{"$error":"#N/A"},{"$error":"#N/A"},{"$error":"#N/A"},184.59999999999806,{"$error":"#N/A"},{"$error":"#N/A"},{"$error":"#N/A"}]
[{"$nulls":5},{"$error":"#N/A"},184.79999999999805,{"$error":"#N/A"},{"$error":"#N/A"},{"$error":"#N/A"},{"$error":"#N/A"},184.79999999999805,{"$error":"#N/A"},{"$error":"#N/A"},{"$error":"#N/A"},{"$error":"#N/A"},184.79999999999805,{"$error":"#N/A"},{"$error":"#N/A"},{"$error":"#N/A"}]
[{"$nulls":5},{"$error":"#N/A"},184.99999999999804,{"$error":"#N/A"},{"$error":"#N/A"},{"$error":"#N/A"},{"$error":"#N/A"},184.99999999999804,{"$error":"#N/A"},{"$error":"#N/A"},{"$error":"#N/A"},{"$error":"#N/A"},184.99999999999804,{"$error":"#N/A"},{"$error":"#N/A"},{"$error":"#N/A"}]
[{"$nulls":5},{"$error":"#N/A"},185.19999999999803,{"$error":"#N/A"},{"$error":"#N/A"},{"$error":"#N/A"},{"$error":"#N/A"},185.19999999999803,{"$error":"#N/A"},{"$error":"#N/A"},{"$error":"#N/A"},{"$error":"#N/A"},185.19999999999803,{"$error":"#N/A"},{"$error":"#N/A"},{"$error":"#N/A"}]
[{"$nulls":5},{"$error":"#N/A"},185.39999999999802,{"$error":"#N/A"},{"$error":"#N/A"},{"$error":"#N/A"},{"$error":"#N/A"},185.39999999999802,{"$error":"#N/A"},{"$error":"#N/A"},{"$error":"#N/A"},{"$error":"#N/A"},185.39999999999802,{"$error":"#N/A"},{"$error":"#N/A"},{"$error":"#N/A"}]
[{"$nulls":5},{"$error":"#N/A"},185.599999999998,{"$error":"#N/A"},{"$error":"#N/A"},{"$error":"#N/A"},{"$error":"#N/A"},185.599999999998,{"$error":"#N/A"},{"$error":"#N/A"},{"$error":"#N/A"},{"$error":"#N/A"},185.599999999998,{"$error":"#N/A"},{"$error":"#N/A"},{"$error":"#N/A"}]
[{"$nulls":5},{"$error":"#N/A"},185.799999999998,{"$error":"#N/A"},{"$error":"#N/A"},{"$error":"#N/A"},{"$error":"#N/A"},185.799999999998,{"$error":"#N/A"},{"$error":"#N/A"},{"$error":"#N/A"},{"$error":"#N/A"},185.799999999998,{"$error":"#N/A"},{"$error":"#N/A"},{"$error":"#N/A"}]
[{"$nulls":5},{"$error":"#N/A"},185.99999999999798,{"$error":"#N/A"},{"$error":"#N/A"},{"$error":"#N/A"},{"$error":"#N/A"},185.99999999999798,{"$error":"#N/A"},{"$error":"#N/A"},{"$error":"#N/A"},{"$error":"#N/A"},185.99999999999798,{"$error":"#N/A"},{"$error":"#N/A"},{"$error":"#N/A"}]
[{"$nulls":5},{"$error":"#N/A"},186.19999999999797,{"$error":"#N/A"},{"$error":"#N/A"},{"$error":"#N/A"},{"$error":"#N/A"},186.19999999999797,{"$error":"#N/A"},{"$error":"#N/A"},{"$error":"#N/A"},{"$error":"#N/A"},186.19999999999797,{"$error":"#N/A"},{"$error":"#N/A"},{"$error":"#N/A"}]
[{"$nulls":5},{"$f":"IF(F934<$I$2,F934+30,NA())","v":{"$error":"#N/A"}},{"$f":"G934+$G$2","v":186.39999999999796},{"$f":"-1+COS(F935*PI()/180)+G935","v":{"$error":"#N/A"}},{"$f":"(F935/$I$2)*($D$8-$D$7)+COS(F935*PI()/180)+$D$7-1","v":{"$error":"#N/A"}},{"$f":"$J$2*SIN(F935*PI()/180)+$B$18","v":{"$error":"#N/A"}},{"$error":"#N/A"},186.39999999999796,{"$f":"-1+COS(K935*PI()/180)+L935","v":{"$error":"#N/A"}},{"$f":"(K935/$N$2)*($D$13-$D$12)+COS(K935*PI()/180)+$D$12-1","v":{"$error":"#N/A"}},{"$f":"$O$2*SIN(K935*PI()/180)+$B$19","v":{"$error":"#N/A"}},{"$error":"#N/A"},{"$f":"Q934+$G$2","v":186.39999999999796},{"$f":"-1+COS(P935*PI()/180)+Q935","v":{"$error":"#N/A"}},{"$f":"(P935/$S$2)*($D$18-$D$17)+COS(P935*PI()/180)+$D$17-1","v":{"$error":"#N/A"}},{"$f":"$T$2*SIN(P935*PI()/180)+$B$20","v":{"$error":"#N/A"}}]
[{"$nulls":5},{"$error":"#N/A"},186.59999999999795,{"$error":"#N/A"},{"$error":"#N/A"},{"$error":"#N/A"},{"$error":"#N/A"},186.59999999999795,{"$error":"#N/A"},{"$error":"#N/A"},{"$error":"#N/A"},{"$error":"#N/A"},186.59999999999795,{"$error":"#N/A"},{"$error":"#N/A"},{"$error":"#N/A"}]
[{"$nulls":5},{"$error":"#N/A"},186.79999999999794,{"$error":"#N/A"},{"$error":"#N/A"},{"$error":"#N/A"},{"$error":"#N/A"},186.79999999999794,{"$error":"#N/A"},{"$error":"#N/A"},{"$error":"#N/A"},{"$error":"#N/A"},186.79999999999794,{"$error":"#N/A"},{"$error":"#N/A"},{"$error":"#N/A"}]
[{"$nulls":5},{"$error":"#N/A"},186.99999999999793,{"$error":"#N/A"},{"$error":"#N/A"},{"$error":"#N/A"},{"$error":"#N/A"},186.99999999999793,{"$error":"#N/A"},{"$error":"#N/A"},{"$error":"#N/A"},{"$error":"#N/A"},186.99999999999793,{"$error":"#N/A"},{"$error":"#N/A"},{"$error":"#N/A"}]
[{"$nulls":5},{"$error":"#N/A"},187.1999999999979,{"$error":"#N/A"},{"$error":"#N/A"},{"$error":"#N/A"},{"$error":"#N/A"},187.1999999999979,{"$error":"#N/A"},{"$error":"#N/A"},{"$error":"#N/A"},{"$error":"#N/A"},187.1999999999979,{"$error":"#N/A"},{"$error":"#N/A"},{"$error":"#N/A"}]
[{"$nulls":5},{"$error":"#N/A"},187.3999999999979,{"$error":"#N/A"},{"$error":"#N/A"},{"$error":"#N/A"},{"$error":"#N/A"},187.3999999999979,{"$error":"#N/A"},{"$error":"#N/A"},{"$error":"#N/A"},{"$error":"#N/A"},187.3999999999979,{"$error":"#N/A"},{"$error":"#N/A"},{"$error":"#N/A"}]
[{"$nulls":5},{"$error":"#N/A"},187.5999999999979,{"$error":"#N/A"},{"$error":"#N/A"},{"$error":"#N/A"},{"$error":"#N/A"},187.5999999999979,{"$error":"#N/A"},{"$error":"#N/A"},{"$error":"#N/A"},{"$error":"#N/A"},187.5999999999979,{"$error":"#N/A"},{"$error":"#N/A"},{"$error":"#N/A"}]
[{"$nulls":5},{"$error":"#N/A"},187.79999999999788,{"$error":"#N/A"},{"$error":"#N/A"},{"$error":"#N/A"},{"$error":"#N/A"},187.79999999999788,{"$error":"#N/A"},{"$error":"#N/A"},{"$error":"#N/A"},{"$error":"#N/A"},187.79999999999788,{"$error":"#N/A"},{"$error":"#N/A"},{"$error":"#N/A"}]
[{"$nulls":5},{"$error":"#N/A"},187.99999999999787,{"$error":"#N/A"},{"$error":"#N/A"},{"$error":"#N/A"},{"$error":"#N/A"},187.99999999999787,{"$error":"#N/A"},{"$error":"#N/A"},{"$error":"#N/A"},{"$error":"#N/A"},187.99999999999787,{"$error":"#N/A"},{"$error":"#N/A"},{"$error":"#N/A"}]
[{"$nulls":5},{"$error":"#N/A"},188.19999999999786,{"$error":"#N/A"},{"$error":"#N/A"},{"$error":"#N/A"},{"$error":"#N/A"},188.19999999999786,{"$error":"#N/A"},{"$error":"#N/A"},{"$error":"#N/A"},{"$error":"#N/A"},188.19999999999786,{"$error":"#N/A"},{"$error":"#N/A"},{"$error":"#N/A"}]
[{"$nulls":5},{"$error":"#N/A"},188.39999999999785,{"$error":"#N/A"},{"$error":"#N/A"},{"$error":"#N/A"},{"$error":"#N/A"},188.39999999999785,{"$error":"#N/A"},{"$error":"#N/A"},{"$error":"#N/A"},{"$error":"#N/A"},188.39999999999785,{"$error":"#N/A"},{"$error":"#N/A"},{"$error":"#N/A"}]
[{"$nulls":5},{"$error":"#N/A"},188.59999999999783,{"$error":"#N/A"},{"$error":"#N/A"},{"$error":"#N/A"},{"$error":"#N/A"},188.59999999999783,{"$error":"#N/A"},{"$error":"#N/A"},{"$error":"#N/A"},{"$error":"#N/A"},188.59999999999783,{"$error":"#N/A"},{"$error":"#N/A"},{"$error":"#N/A"}]
[{"$nulls":5},{"$error":"#N/A"},188.79999999999782,{"$error":"#N/A"},{"$error":"#N/A"},{"$error":"#N/A"},{"$error":"#N/A"},188.79999999999782,{"$error":"#N/A"},{"$error":"#N/A"},{"$error":"#N/A"},{"$error":"#N/A"},188.79999999999782,{"$error":"#N/A"},{"$error":"#N/A"},{"$error":"#N/A"}]
[{"$nulls":5},{"$error":"#N/A"},188.9999999999978,{"$error":"#N/A"},{"$error":"#N/A"},{"$error":"#N/A"},{"$error":"#N/A"},188.9999999999978,{"$error":"#N/A"},{"$error":"#N/A"},{"$error":"#N/A"},{"$error":"#N/A"},188.9999999999978,{"$error":"#N/A"},{"$error":"#N/A"},{"$error":"#N/A"}]
[{"$nulls":5},{"$error":"#N/A"},189.1999999999978,{"$error":"#N/A"},{"$error":"#N/A"},{"$error":"#N/A"},{"$error":"#N/A"},189.1999999999978,{"$error":"#N/A"},{"$error":"#N/A"},{"$error":"#N/A"},{"$error":"#N/A"},189.1999999999978,{"$error":"#N/A"},{"$error":"#N/A"},{"$error":"#N/A"}]
[{"$nulls":5},{"$error":"#N/A"},189.3999999999978,{"$error":"#N/A"},{"$error":"#N/A"},{"$error":"#N/A"},{"$error":"#N/A"},189.3999999999978,{"$error":"#N/A"},{"$error":"#N/A"},{"$error":"#N/A"},{"$error":"#N/A"},189.3999999999978,{"$error":"#N/A"},{"$error":"#N/A"},{"$error":"#N/A"}]
[{"$nulls":5},{"$error":"#N/A"},189.59999999999778,{"$error":"#N/A"},{"$error":"#N/A"},{"$error":"#N/A"},{"$error":"#N/A"},189.59999999999778,{"$error":"#N/A"},{"$error":"#N/A"},{"$error":"#N/A"},{"$error":"#N/A"},189.59999999999778,{"$error":"#N/A"},{"$error":"#N/A"},{"$error":"#N/A"}]
[{"$nulls":5},{"$error":"#N/A"},189.79999999999777,{"$error":"#N/A"},{"$error":"#N/A"},{"$error":"#N/A"},{"$error":"#N/A"},189.79999999999777,{"$error":"#N/A"},{"$error":"#N/A"},{"$error":"#N/A"},{"$error":"#N/A"},189.79999999999777,{"$error":"#N/A"},{"$error":"#N/A"},{"$error":"#N/A"}]
[{"$nulls":5},{"$error":"#N/A"},189.99999999999775,{"$error":"#N/A"},{"$error":"#N/A"},{"$error":"#N/A"},{"$error":"#N/A"},189.99999999999775,{"$error":"#N/A"},{"$error":"#N/A"},{"$error":"#N/A"},{"$error":"#N/A"},189.99999999999775,{"$error":"#N/A"},{"$error":"#N/A"},{"$error":"#N/A"}]
[{"$nulls":5},{"$error":"#N/A"},190.19999999999774,{"$error":"#N/A"},{"$error":"#N/A"},{"$error":"#N/A"},{"$error":"#N/A"},190.19999999999774,{"$error":"#N/A"},{"$error":"#N/A"},{"$error":"#N/A"},{"$error":"#N/A"},190.19999999999774,{"$error":"#N/A"},{"$error":"#N/A"},{"$error":"#N/A"}]
[{"$nulls":5},{"$error":"#N/A"},190.39999999999773,{"$error":"#N/A"},{"$error":"#N/A"},{"$error":"#N/A"},{"$error":"#N/A"},190.39999999999773,{"$error":"#N/A"},{"$error":"#N/A"},{"$error":"#N/A"},{"$error":"#N/A"},190.39999999999773,{"$error":"#N/A"},{"$error":"#N/A"},{"$error":"#N/A"}]
[{"$nulls":5},{"$error":"#N/A"},190.59999999999772,{"$error":"#N/A"},{"$error":"#N/A"},{"$error":"#N/A"},{"$error":"#N/A"},190.59999999999772,{"$error":"#N/A"},{"$error":"#N/A"},{"$error":"#N/A"},{"$error":"#N/A"},190.59999999999772,{"$error":"#N/A"},{"$error":"#N/A"},{"$error":"#N/A"}]
[{"$nulls":5},{"$error":"#N/A"},190.7999999999977,{"$error":"#N/A"},{"$error":"#N/A"},{"$error":"#N/A"},{"$error":"#N/A"},190.7999999999977,{"$error":"#N/A"},{"$error":"#N/A"},{"$error":"#N/A"},{"$error":"#N/A"},190.7999999999977,{"$error":"#N/A"},{"$error":"#N/A"},{"$error":"#N/A"}]
[{"$nulls":5},{"$error":"#N/A"},190.9999999999977,{"$error":"#N/A"},{"$error":"#N/A"},{"$error":"#N/A"},{"$error":"#N/A"},190.9999999999977,{"$error":"#N/A"},{"$error":"#N/A"},{"$error":"#N/A"},{"$error":"#N/A"},190.9999999999977,{"$error":"#N/A"},{"$error":"#N/A"},{"$error":"#N/A"}]
[{"$nulls":5},{"$error":"#N/A"},191.1999999999977,{"$error":"#N/A"},{"$error":"#N/A"},{"$error":"#N/A"},{"$error":"#N/A"},191.1999999999977,{"$error":"#N/A"},{"$error":"#N/A"},{"$error":"#N/A"},{"$error":"#N/A"},191.1999999999977,{"$error":"#N/A"},{"$error":"#N/A"},{"$error":"#N/A"}]
[{"$nulls":5},{"$error":"#N/A"},191.39999999999768,{"$error":"#N/A"},{"$error":"#N/A"},{"$error":"#N/A"},{"$error":"#N/A"},191.39999999999768,{"$error":"#N/A"},{"$error":"#N/A"},{"$error":"#N/A"},{"$error":"#N/A"},191.39999999999768,{"$error":"#N/A"},{"$error":"#N/A"},{"$error":"#N/A"}]
[{"$nulls":5},{"$error":"#N/A"},191.59999999999766,{"$error":"#N/A"},{"$error":"#N/A"},{"$error":"#N/A"},{"$error":"#N/A"},191.59999999999766,{"$error":"#N/A"},{"$error":"#N/A"},{"$error":"#N/A"},{"$error":"#N/A"},191.59999999999766,{"$error":"#N/A"},{"$error":"#N/A"},{"$error":"#N/A"}]
[{"$nulls":5},{"$error":"#N/A"},191.79999999999765,{"$error":"#N/A"},{"$error":"#N/A"},{"$error":"#N/A"},{"$error":"#N/A"},191.79999999999765,{"$error":"#N/A"},{"$error":"#N/A"},{"$error":"#N/A"},{"$error":"#N/A"},191.79999999999765,{"$error":"#N/A"},{"$error":"#N/A"},{"$error":"#N/A"}]
[{"$nulls":5},{"$error":"#N/A"},191.99999999999764,{"$error":"#N/A"},{"$error":"#N/A"},{"$error":"#N/A"},{"$error":"#N/A"},191.99999999999764,{"$error":"#N/A"},{"$error":"#N/A"},{"$error":"#N/A"},{"$error":"#N/A"},191.99999999999764,{"$error":"#N/A"},{"$error":"#N/A"},{"$error":"#N/A"}]
[{"$nulls":5},{"$error":"#N/A"},192.19999999999763,{"$error":"#N/A"},{"$error":"#N/A"},{"$error":"#N/A"},{"$error":"#N/A"},192.19999999999763,{"$error":"#N/A"},{"$error":"#N/A"},{"$error":"#N/A"},{"$error":"#N/A"},192.19999999999763,{"$error":"#N/A"},{"$error":"#N/A"},{"$error":"#N/A"}]
[{"$nulls":5},{"$error":"#N/A"},192.39999999999762,{"$error":"#N/A"},{"$error":"#N/A"},{"$error":"#N/A"},{"$f":"IF(K964<$N$2,K964+30,NA())","v":{"$error":"#N/A"}},{"$f":"L964+$L$2","v":192.39999999999762},{"$error":"#N/A"},{"$error":"#N/A"},{"$error":"#N/A"},{"$f":"IF(P964<$S$2,P964+30,NA())","v":{"$error":"#N/A"}},192.39999999999762,{"$error":"#N/A"},{"$error":"#N/A"},{"$error":"#N/A"}]
[{"$nulls":5},{"$error":"#N/A"},192.5999999999976,{"$error":"#N/A"},{"$error":"#N/A"},{"$error":"#N/A"},{"$error":"#N/A"},192.5999999999976,{"$error":"#N/A"},{"$error":"#N/A"},{"$error":"#N/A"},{"$error":"#N/A"},192.5999999999976,{"$error":"#N/A"},{"$error":"#N/A"},{"$error":"#N/A"}]
[{"$nulls":5},{"$error":"#N/A"},192.7999999999976,{"$error":"#N/A"},{"$error":"#N/A"},{"$error":"#N/A"},{"$error":"#N/A"},192.7999999999976,{"$error":"#N/A"},{"$error":"#N/A"},{"$error":"#N/A"},{"$error":"#N/A"},192.7999999999976,{"$error":"#N/A"},{"$error":"#N/A"},{"$error":"#N/A"}]
[{"$nulls":5},{"$error":"#N/A"},192.99999999999758,{"$error":"#N/A"},{"$error":"#N/A"},{"$error":"#N/A"},{"$error":"#N/A"},192.99999999999758,{"$error":"#N/A"},{"$error":"#N/A"},{"$error":"#N/A"},{"$error":"#N/A"},192.99999999999758,{"$error":"#N/A"},{"$error":"#N/A"},{"$error":"#N/A"}]
[{"$nulls":5},{"$error":"#N/A"},193.19999999999757,{"$error":"#N/A"},{"$error":"#N/A"},{"$error":"#N/A"},{"$error":"#N/A"},193.19999999999757,{"$error":"#N/A"},{"$error":"#N/A"},{"$error":"#N/A"},{"$error":"#N/A"},193.19999999999757,{"$error":"#N/A"},{"$error":"#N/A"},{"$error":"#N/A"}]
[{"$nulls":5},{"$error":"#N/A"},193.39999999999756,{"$error":"#N/A"},{"$error":"#N/A"},{"$error":"#N/A"},{"$error":"#N/A"},193.39999999999756,{"$error":"#N/A"},{"$error":"#N/A"},{"$error":"#N/A"},{"$error":"#N/A"},193.39999999999756,{"$error":"#N/A"},{"$error":"#N/A"},{"$error":"#N/A"}]
[{"$nulls":5},{"$error":"#N/A"},193.59999999999755,{"$error":"#N/A"},{"$error":"#N/A"},{"$error":"#N/A"},{"$error":"#N/A"},193.59999999999755,{"$error":"#N/A"},{"$error":"#N/A"},{"$error":"#N/A"},{"$error":"#N/A"},193.59999999999755,{"$error":"#N/A"},{"$error":"#N/A"},{"$error":"#N/A"}]
[{"$nulls":5},{"$error":"#N/A"},193.79999999999754,{"$error":"#N/A"},{"$error":"#N/A"},{"$error":"#N/A"},{"$error":"#N/A"},193.79999999999754,{"$error":"#N/A"},{"$error":"#N/A"},{"$error":"#N/A"},{"$error":"#N/A"},193.79999999999754,{"$error":"#N/A"},{"$error":"#N/A"},{"$error":"#N/A"}]
[{"$nulls":5},{"$error":"#N/A"},193.99999999999753,{"$error":"#N/A"},{"$error":"#N/A"},{"$error":"#N/A"},{"$error":"#N/A"},193.99999999999753,{"$error":"#N/A"},{"$error":"#N/A"},{"$error":"#N/A"},{"$error":"#N/A"},193.99999999999753,{"$error":"#N/A"},{"$error":"#N/A"},{"$error":"#N/A"}]
[{"$nulls":5},{"$error":"#N/A"},194.19999999999752,{"$error":"#N/A"},{"$error":"#N/A"},{"$error":"#N/A"},{"$error":"#N/A"},194.19999999999752,{"$error":"#N/A"},{"$error":"#N/A"},{"$error":"#N/A"},{"$error":"#N/A"},194.19999999999752,{"$error":"#N/A"},{"$error":"#N/A"},{"$error":"#N/A"}]
[{"$nulls":5},{"$error":"#N/A"},194.3999999999975,{"$error":"#N/A"},{"$error":"#N/A"},{"$error":"#N/A"},{"$error":"#N/A"},194.3999999999975,{"$error":"#N/A"},{"$error":"#N/A"},{"$error":"#N/A"},{"$error":"#N/A"},194.3999999999975,{"$error":"#N/A"},{"$error":"#N/A"},{"$error":"#N/A"}]
[{"$nulls":5},{"$error":"#N/A"},194.5999999999975,{"$error":"#N/A"},{"$error":"#N/A"},{"$error":"#N/A"},{"$error":"#N/A"},194.5999999999975,{"$error":"#N/A"},{"$error":"#N/A"},{"$error":"#N/A"},{"$error":"#N/A"},194.5999999999975,{"$error":"#N/A"},{"$error":"#N/A"},{"$error":"#N/A"}]
[{"$nulls":5},{"$error":"#N/A"},194.79999999999748,{"$error":"#N/A"},{"$error":"#N/A"},{"$error":"#N/A"},{"$error":"#N/A"},194.79999999999748,{"$error":"#N/A"},{"$error":"#N/A"},{"$error":"#N/A"},{"$error":"#N/A"},194.79999999999748,{"$error":"#N/A"},{"$error":"#N/A"},{"$error":"#N/A"}]
[{"$nulls":5},{"$error":"#N/A"},194.99999999999747,{"$error":"#N/A"},{"$error":"#N/A"},{"$error":"#N/A"},{"$error":"#N/A"},194.99999999999747,{"$error":"#N/A"},{"$error":"#N/A"},{"$error":"#N/A"},{"$error":"#N/A"},194.99999999999747,{"$error":"#N/A"},{"$error":"#N/A"},{"$error":"#N/A"}]
[{"$nulls":5},{"$error":"#N/A"},195.19999999999746,{"$error":"#N/A"},{"$error":"#N/A"},{"$error":"#N/A"},{"$error":"#N/A"},195.19999999999746,{"$error":"#N/A"},{"$error":"#N/A"},{"$error":"#N/A"},{"$error":"#N/A"},195.19999999999746,{"$error":"#N/A"},{"$error":"#N/A"},{"$error":"#N/A"}]
[{"$nulls":5},{"$error":"#N/A"},195.39999999999745,{"$error":"#N/A"},{"$error":"#N/A"},{"$error":"#N/A"},{"$error":"#N/A"},195.39999999999745,{"$error":"#N/A"},{"$error":"#N/A"},{"$error":"#N/A"},{"$error":"#N/A"},195.39999999999745,{"$error":"#N/A"},{"$error":"#N/A"},{"$error":"#N/A"}]
[{"$nulls":5},{"$error":"#N/A"},195.59999999999744,{"$error":"#N/A"},{"$error":"#N/A"},{"$error":"#N/A"},{"$error":"#N/A"},195.59999999999744,{"$error":"#N/A"},{"$error":"#N/A"},{"$error":"#N/A"},{"$error":"#N/A"},195.59999999999744,{"$error":"#N/A"},{"$error":"#N/A"},{"$error":"#N/A"}]
[{"$nulls":5},{"$error":"#N/A"},195.79999999999742,{"$error":"#N/A"},{"$error":"#N/A"},{"$error":"#N/A"},{"$error":"#N/A"},195.79999999999742,{"$error":"#N/A"},{"$error":"#N/A"},{"$error":"#N/A"},{"$error":"#N/A"},195.79999999999742,{"$error":"#N/A"},{"$error":"#N/A"},{"$error":"#N/A"}]
[{"$nulls":5},{"$error":"#N/A"},195.9999999999974,{"$error":"#N/A"},{"$error":"#N/A"},{"$error":"#N/A"},{"$error":"#N/A"},195.9999999999974,{"$error":"#N/A"},{"$error":"#N/A"},{"$error":"#N/A"},{"$error":"#N/A"},195.9999999999974,{"$error":"#N/A"},{"$error":"#N/A"},{"$error":"#N/A"}]
[{"$nulls":5},{"$error":"#N/A"},196.1999999999974,{"$error":"#N/A"},{"$error":"#N/A"},{"$error":"#N/A"},{"$error":"#N/A"},196.1999999999974,{"$error":"#N/A"},{"$error":"#N/A"},{"$error":"#N/A"},{"$error":"#N/A"},196.1999999999974,{"$error":"#N/A"},{"$error":"#N/A"},{"$error":"#N/A"}]
[{"$nulls":5},{"$error":"#N/A"},196.3999999999974,{"$error":"#N/A"},{"$error":"#N/A"},{"$error":"#N/A"},{"$error":"#N/A"},196.3999999999974,{"$error":"#N/A"},{"$error":"#N/A"},{"$error":"#N/A"},{"$error":"#N/A"},196.3999999999974,{"$error":"#N/A"},{"$error":"#N/A"},{"$error":"#N/A"}]
[{"$nulls":5},{"$error":"#N/A"},196.59999999999738,{"$error":"#N/A"},{"$error":"#N/A"},{"$error":"#N/A"},{"$error":"#N/A"},196.59999999999738,{"$error":"#N/A"},{"$error":"#N/A"},{"$error":"#N/A"},{"$error":"#N/A"},196.59999999999738,{"$error":"#N/A"},{"$error":"#N/A"},{"$error":"#N/A"}]
[{"$nulls":5},{"$error":"#N/A"},196.79999999999737,{"$error":"#N/A"},{"$error":"#N/A"},{"$error":"#N/A"},{"$error":"#N/A"},196.79999999999737,{"$error":"#N/A"},{"$error":"#N/A"},{"$error":"#N/A"},{"$error":"#N/A"},196.79999999999737,{"$error":"#N/A"},{"$error":"#N/A"},{"$error":"#N/A"}]
[{"$nulls":5},{"$error":"#N/A"},196.99999999999736,{"$error":"#N/A"},{"$error":"#N/A"},{"$error":"#N/A"},{"$error":"#N/A"},196.99999999999736,{"$error":"#N/A"},{"$error":"#N/A"},{"$error":"#N/A"},{"$error":"#N/A"},196.99999999999736,{"$error":"#N/A"},{"$error":"#N/A"},{"$error":"#N/A"}]
[{"$nulls":5},{"$error":"#N/A"},197.19999999999735,{"$error":"#N/A"},{"$error":"#N/A"},{"$error":"#N/A"},{"$error":"#N/A"},197.19999999999735,{"$error":"#N/A"},{"$error":"#N/A"},{"$error":"#N/A"},{"$error":"#N/A"},197.19999999999735,{"$error":"#N/A"},{"$error":"#N/A"},{"$error":"#N/A"}]
[{"$nulls":5},{"$error":"#N/A"},197.39999999999733,{"$error":"#N/A"},{"$error":"#N/A"},{"$error":"#N/A"},{"$error":"#N/A"},197.39999999999733,{"$error":"#N/A"},{"$error":"#N/A"},{"$error":"#N/A"},{"$error":"#N/A"},197.39999999999733,{"$error":"#N/A"},{"$error":"#N/A"},{"$error":"#N/A"}]
[{"$nulls":5},{"$error":"#N/A"},197.59999999999732,{"$error":"#N/A"},{"$error":"#N/A"},{"$error":"#N/A"},{"$error":"#N/A"},197.59999999999732,{"$error":"#N/A"},{"$error":"#N/A"},{"$error":"#N/A"},{"$error":"#N/A"},197.59999999999732,{"$error":"#N/A"},{"$error":"#N/A"},{"$error":"#N/A"}]
[{"$nulls":5},{"$error":"#N/A"},197.7999999999973,{"$error":"#N/A"},{"$error":"#N/A"},{"$error":"#N/A"},{"$error":"#N/A"},197.7999999999973,{"$error":"#N/A"},{"$error":"#N/A"},{"$error":"#N/A"},{"$error":"#N/A"},197.7999999999973,{"$error":"#N/A"},{"$error":"#N/A"},{"$error":"#N/A"}]
[{"$nulls":5},{"$error":"#N/A"},197.9999999999973,{"$error":"#N/A"},{"$error":"#N/A"},{"$error":"#N/A"},{"$error":"#N/A"},197.9999999999973,{"$error":"#N/A"},{"$error":"#N/A"},{"$error":"#N/A"},{"$error":"#N/A"},197.9999999999973,{"$error":"#N/A"},{"$error":"#N/A"},{"$error":"#N/A"}]
[{"$nulls":5},{"$error":"#N/A"},198.1999999999973,{"$error":"#N/A"},{"$error":"#N/A"},{"$error":"#N/A"},{"$error":"#N/A"},198.1999999999973,{"$error":"#N/A"},{"$error":"#N/A"},{"$error":"#N/A"},{"$error":"#N/A"},198.1999999999973,{"$error":"#N/A"},{"$error":"#N/A"},{"$error":"#N/A"}]
[{"$nulls":5},{"$error":"#N/A"},198.39999999999728,{"$error":"#N/A"},{"$error":"#N/A"},{"$error":"#N/A"},{"$error":"#N/A"},198.39999999999728,{"$error":"#N/A"},{"$error":"#N/A"},{"$error":"#N/A"},{"$error":"#N/A"},198.39999999999728,{"$error":"#N/A"},{"$error":"#N/A"},{"$error":"#N/A"}]
[{"$nulls":5},{"$error":"#N/A"},198.59999999999727,{"$error":"#N/A"},{"$error":"#N/A"},{"$error":"#N/A"},{"$error":"#N/A"},198.59999999999727,{"$error":"#N/A"},{"$error":"#N/A"},{"$error":"#N/A"},{"$error":"#N/A"},198.59999999999727,{"$error":"#N/A"},{"$error":"#N/A"},{"$error":"#N/A"}]
[{"$nulls":5},{"$error":"#N/A"},198.79999999999725,{"$error":"#N/A"},{"$error":"#N/A"},{"$error":"#N/A"},{"$error":"#N/A"},198.79999999999725,{"$error":"#N/A"},{"$error":"#N/A"},{"$error":"#N/A"},{"$error":"#N/A"},198.79999999999725,{"$error":"#N/A"},{"$error":"#N/A"},{"$error":"#N/A"}]
[{"$nulls":5},{"$error":"#N/A"},198.99999999999724,{"$error":"#N/A"},{"$error":"#N/A"},{"$error":"#N/A"},{"$error":"#N/A"},198.99999999999724,{"$error":"#N/A"},{"$error":"#N/A"},{"$error":"#N/A"},{"$error":"#N/A"},198.99999999999724,{"$error":"#N/A"},{"$error":"#N/A"},{"$error":"#N/A"}]
[{"$nulls":5},{"$f":"IF(F998<$I$2,F998+30,NA())","v":{"$error":"#N/A"}},{"$f":"G998+$G$2","v":199.19999999999723},{"$f":"-1+COS(F999*PI()/180)+G999","v":{"$error":"#N/A"}},{"$f":"(F999/$I$2)*($D$8-$D$7)+COS(F999*PI()/180)+$D$7-1","v":{"$error":"#N/A"}},{"$f":"$J$2*SIN(F999*PI()/180)+$B$18","v":{"$error":"#N/A"}},{"$error":"#N/A"},199.19999999999723,{"$f":"-1+COS(K999*PI()/180)+L999","v":{"$error":"#N/A"}},{"$f":"(K999/$N$2)*($D$13-$D$12)+COS(K999*PI()/180)+$D$12-1","v":{"$error":"#N/A"}},{"$f":"$O$2*SIN(K999*PI()/180)+$B$19","v":{"$error":"#N/A"}},{"$error":"#N/A"},{"$f":"Q998+$G$2","v":199.19999999999723},{"$f":"-1+COS(P999*PI()/180)+Q999","v":{"$error":"#N/A"}},{"$f":"(P999/$S$2)*($D$18-$D$17)+COS(P999*PI()/180)+$D$17-1","v":{"$error":"#N/A"}},{"$f":"$T$2*SIN(P999*PI()/180)+$B$20","v":{"$error":"#N/A"}}]
[{"$nulls":5},{"$error":"#N/A"},199.39999999999722,{"$error":"#N/A"},{"$error":"#N/A"},{"$error":"#N/A"},{"$error":"#N/A"},199.39999999999722,{"$error":"#N/A"},{"$error":"#N/A"},{"$error":"#N/A"},{"$error":"#N/A"},199.39999999999722,{"$error":"#N/A"},{"$error":"#N/A"},{"$error":"#N/A"}]
[{"$nulls":5},{"$error":"#N/A"},199.5999999999972,{"$error":"#N/A"},{"$error":"#N/A"},{"$error":"#N/A"},{"$error":"#N/A"},199.5999999999972,{"$error":"#N/A"},{"$error":"#N/A"},{"$error":"#N/A"},{"$error":"#N/A"},199.5999999999972,{"$error":"#N/A"},{"$error":"#N/A"},{"$error":"#N/A"}]
[{"$nulls":5},{"$error":"#N/A"},199.7999999999972,{"$error":"#N/A"},{"$error":"#N/A"},{"$error":"#N/A"},{"$error":"#N/A"},199.7999999999972,{"$error":"#N/A"},{"$error":"#N/A"},{"$error":"#N/A"},{"$error":"#N/A"},199.7999999999972,{"$error":"#N/A"},{"$error":"#N/A"},{"$error":"#N/A"}]
[{"$nulls":5},{"$error":"#N/A"},199.9999999999972,{"$error":"#N/A"},{"$error":"#N/A"},{"$error":"#N/A"},{"$error":"#N/A"},199.9999999999972,{"$error":"#N/A"},{"$error":"#N/A"},{"$error":"#N/A"},{"$error":"#N/A"},199.9999999999972,{"$error":"#N/A"},{"$error":"#N/A"},{"$error":"#N/A"}]
[{"$nulls":5},{"$error":"#N/A"},200.19999999999717,{"$error":"#N/A"},{"$error":"#N/A"},{"$error":"#N/A"},{"$error":"#N/A"},200.19999999999717,{"$error":"#N/A"},{"$error":"#N/A"},{"$error":"#N/A"},{"$error":"#N/A"},200.19999999999717,{"$error":"#N/A"},{"$error":"#N/A"},{"$error":"#N/A"}]
[{"$nulls":5},{"$error":"#N/A"},200.39999999999716,{"$error":"#N/A"},{"$error":"#N/A"},{"$error":"#N/A"},{"$error":"#N/A"},200.39999999999716,{"$error":"#N/A"},{"$error":"#N/A"},{"$error":"#N/A"},{"$error":"#N/A"},200.39999999999716,{"$error":"#N/A"},{"$error":"#N/A"},{"$error":"#N/A"}]
[{"$nulls":5},{"$error":"#N/A"},200.59999999999715,{"$error":"#N/A"},{"$error":"#N/A"},{"$error":"#N/A"},{"$error":"#N/A"},200.59999999999715,{"$error":"#N/A"},{"$error":"#N/A"},{"$error":"#N/A"},{"$error":"#N/A"},200.59999999999715,{"$error":"#N/A"},{"$error":"#N/A"},{"$error":"#N/A"}]
[{"$nulls":5},{"$error":"#N/A"},200.79999999999714,{"$error":"#N/A"},{"$error":"#N/A"},{"$error":"#N/A"},{"$error":"#N/A"},200.79999999999714,{"$error":"#N/A"},{"$error":"#N/A"},{"$error":"#N/A"},{"$error":"#N/A"},200.79999999999714,{"$error":"#N/A"},{"$error":"#N/A"},{"$error":"#N/A"}]
[{"$nulls":5},{"$error":"#N/A"},200.99999999999713,{"$error":"#N/A"},{"$error":"#N/A"},{"$error":"#N/A"},{"$error":"#N/A"},200.99999999999713,{"$error":"#N/A"},{"$error":"#N/A"},{"$error":"#N/A"},{"$error":"#N/A"},200.99999999999713,{"$error":"#N/A"},{"$error":"#N/A"},{"$error":"#N/A"}]
[{"$nulls":5},{"$error":"#N/A"},201.19999999999712,{"$error":"#N/A"},{"$error":"#N/A"},{"$error":"#N/A"},{"$error":"#N/A"},201.19999999999712,{"$error":"#N/A"},{"$error":"#N/A"},{"$error":"#N/A"},{"$error":"#N/A"},201.19999999999712,{"$error":"#N/A"},{"$error":"#N/A"},{"$error":"#N/A"}]
[{"$nulls":5},{"$error":"#N/A"},201.3999999999971,{"$error":"#N/A"},{"$error":"#N/A"},{"$error":"#N/A"},{"$error":"#N/A"},201.3999999999971,{"$error":"#N/A"},{"$error":"#N/A"},{"$error":"#N/A"},{"$error":"#N/A"},201.3999999999971,{"$error":"#N/A"},{"$error":"#N/A"},{"$error":"#N/A"}]
[{"$nulls":5},{"$error":"#N/A"},201.5999999999971,{"$error":"#N/A"},{"$error":"#N/A"},{"$error":"#N/A"},{"$error":"#N/A"},201.5999999999971,{"$error":"#N/A"},{"$error":"#N/A"},{"$error":"#N/A"},{"$error":"#N/A"},201.5999999999971,{"$error":"#N/A"},{"$error":"#N/A"},{"$error":"#N/A"}]
[{"$nulls":5},{"$error":"#N/A"},201.79999999999708,{"$error":"#N/A"},{"$error":"#N/A"},{"$error":"#N/A"},{"$error":"#N/A"},201.79999999999708,{"$error":"#N/A"},{"$error":"#N/A"},{"$error":"#N/A"},{"$error":"#N/A"},201.79999999999708,{"$error":"#N/A"},{"$error":"#N/A"},{"$error":"#N/A"}]
[{"$nulls":5},{"$error":"#N/A"},201.99999999999707,{"$error":"#N/A"},{"$error":"#N/A"},{"$error":"#N/A"},{"$error":"#N/A"},201.99999999999707,{"$error":"#N/A"},{"$error":"#N/A"},{"$error":"#N/A"},{"$error":"#N/A"},201.99999999999707,{"$error":"#N/A"},{"$error":"#N/A"},{"$error":"#N/A"}]
[{"$nulls":5},{"$error":"#N/A"},202.19999999999706,{"$error":"#N/A"},{"$error":"#N/A"},{"$error":"#N/A"},{"$error":"#N/A"},202.19999999999706,{"$error":"#N/A"},{"$error":"#N/A"},{"$error":"#N/A"},{"$error":"#N/A"},202.19999999999706,{"$error":"#N/A"},{"$error":"#N/A"},{"$error":"#N/A"}]
[{"$nulls":5},{"$error":"#N/A"},202.39999999999705,{"$error":"#N/A"},{"$error":"#N/A"},{"$error":"#N/A"},{"$error":"#N/A"},202.39999999999705,{"$error":"#N/A"},{"$error":"#N/A"},{"$error":"#N/A"},{"$error":"#N/A"},202.39999999999705,{"$error":"#N/A"},{"$error":"#N/A"},{"$error":"#N/A"}]
[{"$nulls":5},{"$error":"#N/A"},202.59999999999704,{"$error":"#N/A"},{"$error":"#N/A"},{"$error":"#N/A"},{"$error":"#N/A"},202.59999999999704,{"$error":"#N/A"},{"$error":"#N/A"},{"$error":"#N/A"},{"$error":"#N/A"},202.59999999999704,{"$error":"#N/A"},{"$error":"#N/A"},{"$error":"#N/A"}]
[{"$nulls":5},{"$error":"#N/A"},202.79999999999703,{"$error":"#N/A"},{"$error":"#N/A"},{"$error":"#N/A"},{"$error":"#N/A"},202.79999999999703,{"$error":"#N/A"},{"$error":"#N/A"},{"$error":"#N/A"},{"$error":"#N/A"},202.79999999999703,{"$error":"#N/A"},{"$error":"#N/A"},{"$error":"#N/A"}]
[{"$nulls":5},{"$error":"#N/A"},202.99999999999702,{"$error":"#N/A"},{"$error":"#N/A"},{"$error":"#N/A"},{"$error":"#N/A"},202.99999999999702,{"$error":"#N/A"},{"$error":"#N/A"},{"$error":"#N/A"},{"$error":"#N/A"},202.99999999999702,{"$error":"#N/A"},{"$error":"#N/A"},{"$error":"#N/A"}]
[{"$nulls":5},{"$error":"#N/A"},203.199999999997,{"$error":"#N/A"},{"$error":"#N/A"},{"$error":"#N/A"},{"$error":"#N/A"},203.199999999997,{"$error":"#N/A"},{"$error":"#N/A"},{"$error":"#N/A"},{"$error":"#N/A"},203.199999999997,{"$error":"#N/A"},{"$error":"#N/A"},{"$error":"#N/A"}]
[{"$nulls":5},{"$error":"#N/A"},203.399999999997,{"$error":"#N/A"},{"$error":"#N/A"},{"$error":"#N/A"},{"$error":"#N/A"},203.399999999997,{"$error":"#N/A"},{"$error":"#N/A"},{"$error":"#N/A"},{"$error":"#N/A"},203.399999999997,{"$error":"#N/A"},{"$error":"#N/A"},{"$error":"#N/A"}]
[{"$nulls":5},{"$error":"#N/A"},203.59999999999698,{"$error":"#N/A"},{"$error":"#N/A"},{"$error":"#N/A"},{"$error":"#N/A"},203.59999999999698,{"$error":"#N/A"},{"$error":"#N/A"},{"$error":"#N/A"},{"$error":"#N/A"},203.59999999999698,{"$error":"#N/A"},{"$error":"#N/A"},{"$error":"#N/A"}]
[{"$nulls":5},{"$error":"#N/A"},203.79999999999697,{"$error":"#N/A"},{"$error":"#N/A"},{"$error":"#N/A"},{"$error":"#N/A"},203.79999999999697,{"$error":"#N/A"},{"$error":"#N/A"},{"$error":"#N/A"},{"$error":"#N/A"},203.79999999999697,{"$error":"#N/A"},{"$error":"#N/A"},{"$error":"#N/A"}]
[{"$nulls":5},{"$error":"#N/A"},203.99999999999696,{"$error":"#N/A"},{"$error":"#N/A"},{"$error":"#N/A"},{"$error":"#N/A"},203.99999999999696,{"$error":"#N/A"},{"$error":"#N/A"},{"$error":"#N/A"},{"$error":"#N/A"},203.99999999999696,{"$error":"#N/A"},{"$error":"#N/A"},{"$error":"#N/A"}]
[{"$nulls":5},{"$error":"#N/A"},204.19999999999695,{"$error":"#N/A"},{"$error":"#N/A"},{"$error":"#N/A"},{"$error":"#N/A"},204.19999999999695,{"$error":"#N/A"},{"$error":"#N/A"},{"$error":"#N/A"},{"$error":"#N/A"},204.19999999999695,{"$error":"#N/A"},{"$error":"#N/A"},{"$error":"#N/A"}]
[{"$nulls":5},{"$error":"#N/A"},204.39999999999694,{"$error":"#N/A"},{"$error":"#N/A"},{"$error":"#N/A"},{"$error":"#N/A"},204.39999999999694,{"$error":"#N/A"},{"$error":"#N/A"},{"$error":"#N/A"},{"$error":"#N/A"},204.39999999999694,{"$error":"#N/A"},{"$error":"#N/A"},{"$error":"#N/A"}]
[{"$nulls":5},{"$error":"#N/A"},204.59999999999692,{"$error":"#N/A"},{"$error":"#N/A"},{"$error":"#N/A"},{"$error":"#N/A"},204.59999999999692,{"$error":"#N/A"},{"$error":"#N/A"},{"$error":"#N/A"},{"$error":"#N/A"},204.59999999999692,{"$error":"#N/A"},{"$error":"#N/A"},{"$error":"#N/A"}]
[{"$nulls":5},{"$error":"#N/A"},204.7999999999969,{"$error":"#N/A"},{"$error":"#N/A"},{"$error":"#N/A"},{"$error":"#N/A"},204.7999999999969,{"$error":"#N/A"},{"$error":"#N/A"},{"$error":"#N/A"},{"$error":"#N/A"},204.7999999999969,{"$error":"#N/A"},{"$error":"#N/A"},{"$error":"#N/A"}]
[{"$nulls":5},{"$error":"#N/A"},204.9999999999969,{"$error":"#N/A"},{"$error":"#N/A"},{"$error":"#N/A"},{"$error":"#N/A"},204.9999999999969,{"$error":"#N/A"},{"$error":"#N/A"},{"$error":"#N/A"},{"$error":"#N/A"},204.9999999999969,{"$error":"#N/A"},{"$error":"#N/A"},{"$error":"#N/A"}]
[{"$nulls":5},{"$error":"#N/A"},205.1999999999969,{"$error":"#N/A"},{"$error":"#N/A"},{"$error":"#N/A"},{"$f":"IF(K1028<$N$2,K1028+30,NA())","v":{"$error":"#N/A"}},{"$f":"L1028+$L$2","v":205.1999999999969},{"$error":"#N/A"},{"$error":"#N/A"},{"$error":"#N/A"},{"$f":"IF(P1028<$S$2,P1028+30,NA())","v":{"$error":"#N/A"}},205.1999999999969,{"$error":"#N/A"},{"$error":"#N/A"},{"$error":"#N/A"}]
[{"$nulls":5},{"$error":"#N/A"},205.39999999999688,{"$error":"#N/A"},{"$error":"#N/A"},{"$error":"#N/A"},{"$error":"#N/A"},205.39999999999688,{"$error":"#N/A"},{"$error":"#N/A"},{"$error":"#N/A"},{"$error":"#N/A"},205.39999999999688,{"$error":"#N/A"},{"$error":"#N/A"},{"$error":"#N/A"}]
[{"$nulls":5},{"$error":"#N/A"},205.59999999999687,{"$error":"#N/A"},{"$error":"#N/A"},{"$error":"#N/A"},{"$error":"#N/A"},205.59999999999687,{"$error":"#N/A"},{"$error":"#N/A"},{"$error":"#N/A"},{"$error":"#N/A"},205.59999999999687,{"$error":"#N/A"},{"$error":"#N/A"},{"$error":"#N/A"}]
[{"$nulls":5},{"$error":"#N/A"},205.79999999999686,{"$error":"#N/A"},{"$error":"#N/A"},{"$error":"#N/A"},{"$error":"#N/A"},205.79999999999686,{"$error":"#N/A"},{"$error":"#N/A"},{"$error":"#N/A"},{"$error":"#N/A"},205.79999999999686,{"$error":"#N/A"},{"$error":"#N/A"},{"$error":"#N/A"}]
[{"$nulls":5},{"$error":"#N/A"},205.99999999999685,{"$error":"#N/A"},{"$error":"#N/A"},{"$error":"#N/A"},{"$error":"#N/A"},205.99999999999685,{"$error":"#N/A"},{"$error":"#N/A"},{"$error":"#N/A"},{"$error":"#N/A"},205.99999999999685,{"$error":"#N/A"},{"$error":"#N/A"},{"$error":"#N/A"}]
[{"$nulls":5},{"$error":"#N/A"},206.19999999999683,{"$error":"#N/A"},{"$error":"#N/A"},{"$error":"#N/A"},{"$error":"#N/A"},206.19999999999683,{"$error":"#N/A"},{"$error":"#N/A"},{"$error":"#N/A"},{"$error":"#N/A"},206.19999999999683,{"$error":"#N/A"},{"$error":"#N/A"},{"$error":"#N/A"}]
[{"$nulls":5},{"$error":"#N/A"},206.39999999999682,{"$error":"#N/A"},{"$error":"#N/A"},{"$error":"#N/A"},{"$error":"#N/A"},206.39999999999682,{"$error":"#N/A"},{"$error":"#N/A"},{"$error":"#N/A"},{"$error":"#N/A"},206.39999999999682,{"$error":"#N/A"},{"$error":"#N/A"},{"$error":"#N/A"}]
[{"$nulls":5},{"$error":"#N/A"},206.5999999999968,{"$error":"#N/A"},{"$error":"#N/A"},{"$error":"#N/A"},{"$error":"#N/A"},206.5999999999968,{"$error":"#N/A"},{"$error":"#N/A"},{"$error":"#N/A"},{"$error":"#N/A"},206.5999999999968,{"$error":"#N/A"},{"$error":"#N/A"},{"$error":"#N/A"}]
[{"$nulls":5},{"$error":"#N/A"},206.7999999999968,{"$error":"#N/A"},{"$error":"#N/A"},{"$error":"#N/A"},{"$error":"#N/A"},206.7999999999968,{"$error":"#N/A"},{"$error":"#N/A"},{"$error":"#N/A"},{"$error":"#N/A"},206.7999999999968,{"$error":"#N/A"},{"$error":"#N/A"},{"$error":"#N/A"}]
[{"$nulls":5},{"$error":"#N/A"},206.9999999999968,{"$error":"#N/A"},{"$error":"#N/A"},{"$error":"#N/A"},{"$error":"#N/A"},206.9999999999968,{"$error":"#N/A"},{"$error":"#N/A"},{"$error":"#N/A"},{"$error":"#N/A"},206.9999999999968,{"$error":"#N/A"},{"$error":"#N/A"},{"$error":"#N/A"}]
[{"$nulls":5},{"$error":"#N/A"},207.19999999999678,{"$error":"#N/A"},{"$error":"#N/A"},{"$error":"#N/A"},{"$error":"#N/A"},207.19999999999678,{"$error":"#N/A"},{"$error":"#N/A"},{"$error":"#N/A"},{"$error":"#N/A"},207.19999999999678,{"$error":"#N/A"},{"$error":"#N/A"},{"$error":"#N/A"}]
[{"$nulls":5},{"$error":"#N/A"},207.39999999999677,{"$error":"#N/A"},{"$error":"#N/A"},{"$error":"#N/A"},{"$error":"#N/A"},207.39999999999677,{"$error":"#N/A"},{"$error":"#N/A"},{"$error":"#N/A"},{"$error":"#N/A"},207.39999999999677,{"$error":"#N/A"},{"$error":"#N/A"},{"$error":"#N/A"}]
[{"$nulls":5},{"$error":"#N/A"},207.59999999999675,{"$error":"#N/A"},{"$error":"#N/A"},{"$error":"#N/A"},{"$error":"#N/A"},207.59999999999675,{"$error":"#N/A"},{"$error":"#N/A"},{"$error":"#N/A"},{"$error":"#N/A"},207.59999999999675,{"$error":"#N/A"},{"$error":"#N/A"},{"$error":"#N/A"}]
[{"$nulls":5},{"$error":"#N/A"},207.79999999999674,{"$error":"#N/A"},{"$error":"#N/A"},{"$error":"#N/A"},{"$error":"#N/A"},207.79999999999674,{"$error":"#N/A"},{"$error":"#N/A"},{"$error":"#N/A"},{"$error":"#N/A"},207.79999999999674,{"$error":"#N/A"},{"$error":"#N/A"},{"$error":"#N/A"}]
[{"$nulls":5},{"$error":"#N/A"},207.99999999999673,{"$error":"#N/A"},{"$error":"#N/A"},{"$error":"#N/A"},{"$error":"#N/A"},207.99999999999673,{"$error":"#N/A"},{"$error":"#N/A"},{"$error":"#N/A"},{"$error":"#N/A"},207.99999999999673,{"$error":"#N/A"},{"$error":"#N/A"},{"$error":"#N/A"}]
[{"$nulls":5},{"$error":"#N/A"},208.19999999999672,{"$error":"#N/A"},{"$error":"#N/A"},{"$error":"#N/A"},{"$error":"#N/A"},208.19999999999672,{"$error":"#N/A"},{"$error":"#N/A"},{"$error":"#N/A"},{"$error":"#N/A"},208.19999999999672,{"$error":"#N/A"},{"$error":"#N/A"},{"$error":"#N/A"}]
[{"$nulls":5},{"$error":"#N/A"},208.3999999999967,{"$error":"#N/A"},{"$error":"#N/A"},{"$error":"#N/A"},{"$error":"#N/A"},208.3999999999967,{"$error":"#N/A"},{"$error":"#N/A"},{"$error":"#N/A"},{"$error":"#N/A"},208.3999999999967,{"$error":"#N/A"},{"$error":"#N/A"},{"$error":"#N/A"}]
[{"$nulls":5},{"$error":"#N/A"},208.5999999999967,{"$error":"#N/A"},{"$error":"#N/A"},{"$error":"#N/A"},{"$error":"#N/A"},208.5999999999967,{"$error":"#N/A"},{"$error":"#N/A"},{"$error":"#N/A"},{"$error":"#N/A"},208.5999999999967,{"$error":"#N/A"},{"$error":"#N/A"},{"$error":"#N/A"}]
[{"$nulls":5},{"$error":"#N/A"},208.7999999999967,{"$error":"#N/A"},{"$error":"#N/A"},{"$error":"#N/A"},{"$error":"#N/A"},208.7999999999967,{"$error":"#N/A"},{"$error":"#N/A"},{"$error":"#N/A"},{"$error":"#N/A"},208.7999999999967,{"$error":"#N/A"},{"$error":"#N/A"},{"$error":"#N/A"}]
[{"$nulls":5},{"$error":"#N/A"},208.99999999999667,{"$error":"#N/A"},{"$error":"#N/A"},{"$error":"#N/A"},{"$error":"#N/A"},208.99999999999667,{"$error":"#N/A"},{"$error":"#N/A"},{"$error":"#N/A"},{"$error":"#N/A"},208.99999999999667,{"$error":"#N/A"},{"$error":"#N/A"},{"$error":"#N/A"}]
[{"$nulls":5},{"$error":"#N/A"},209.19999999999666,{"$error":"#N/A"},{"$error":"#N/A"},{"$error":"#N/A"},{"$error":"#N/A"},209.19999999999666,{"$error":"#N/A"},{"$error":"#N/A"},{"$error":"#N/A"},{"$error":"#N/A"},209.19999999999666,{"$error":"#N/A"},{"$error":"#N/A"},{"$error":"#N/A"}]
[{"$nulls":5},{"$error":"#N/A"},209.39999999999665,{"$error":"#N/A"},{"$error":"#N/A"},{"$error":"#N/A"},{"$error":"#N/A"},209.39999999999665,{"$error":"#N/A"},{"$error":"#N/A"},{"$error":"#N/A"},{"$error":"#N/A"},209.39999999999665,{"$error":"#N/A"},{"$error":"#N/A"},{"$error":"#N/A"}]
[{"$nulls":5},{"$error":"#N/A"},209.59999999999664,{"$error":"#N/A"},{"$error":"#N/A"},{"$error":"#N/A"},{"$error":"#N/A"},209.59999999999664,{"$error":"#N/A"},{"$error":"#N/A"},{"$error":"#N/A"},{"$error":"#N/A"},209.59999999999664,{"$error":"#N/A"},{"$error":"#N/A"},{"$error":"#N/A"}]
[{"$nulls":5},{"$error":"#N/A"},209.79999999999663,{"$error":"#N/A"},{"$error":"#N/A"},{"$error":"#N/A"},{"$error":"#N/A"},209.79999999999663,{"$error":"#N/A"},{"$error":"#N/A"},{"$error":"#N/A"},{"$error":"#N/A"},209.79999999999663,{"$error":"#N/A"},{"$error":"#N/A"},{"$error":"#N/A"}]
[{"$nulls":5},{"$error":"#N/A"},209.99999999999662,{"$error":"#N/A"},{"$error":"#N/A"},{"$error":"#N/A"},{"$error":"#N/A"},209.99999999999662,{"$error":"#N/A"},{"$error":"#N/A"},{"$error":"#N/A"},{"$error":"#N/A"},209.99999999999662,{"$error":"#N/A"},{"$error":"#N/A"},{"$error":"#N/A"}]
[{"$nulls":5},{"$error":"#N/A"},210.1999999999966,{"$error":"#N/A"},{"$error":"#N/A"},{"$error":"#N/A"},{"$error":"#N/A"},210.1999999999966,{"$error":"#N/A"},{"$error":"#N/A"},{"$error":"#N/A"},{"$error":"#N/A"},210.1999999999966,{"$error":"#N/A"},{"$error":"#N/A"},{"$error":"#N/A"}]
[{"$nulls":5},{"$error":"#N/A"},210.3999999999966,{"$error":"#N/A"},{"$error":"#N/A"},{"$error":"#N/A"},{"$error":"#N/A"},210.3999999999966,{"$error":"#N/A"},{"$error":"#N/A"},{"$error":"#N/A"},{"$error":"#N/A"},210.3999999999966,{"$error":"#N/A"},{"$error":"#N/A"},{"$error":"#N/A"}]
[{"$nulls":5},{"$error":"#N/A"},210.59999999999658,{"$error":"#N/A"},{"$error":"#N/A"},{"$error":"#N/A"},{"$error":"#N/A"},210.59999999999658,{"$error":"#N/A"},{"$error":"#N/A"},{"$error":"#N/A"},{"$error":"#N/A"},210.59999999999658,{"$error":"#N/A"},{"$error":"#N/A"},{"$error":"#N/A"}]
[{"$nulls":5},{"$error":"#N/A"},210.79999999999657,{"$error":"#N/A"},{"$error":"#N/A"},{"$error":"#N/A"},{"$error":"#N/A"},210.79999999999657,{"$error":"#N/A"},{"$error":"#N/A"},{"$error":"#N/A"},{"$error":"#N/A"},210.79999999999657,{"$error":"#N/A"},{"$error":"#N/A"},{"$error":"#N/A"}]
[{"$nulls":5},{"$error":"#N/A"},210.99999999999656,{"$error":"#N/A"},{"$error":"#N/A"},{"$error":"#N/A"},{"$error":"#N/A"},210.99999999999656,{"$error":"#N/A"},{"$error":"#N/A"},{"$error":"#N/A"},{"$error":"#N/A"},210.99999999999656,{"$error":"#N/A"},{"$error":"#N/A"},{"$error":"#N/A"}]
[{"$nulls":5},{"$error":"#N/A"},211.19999999999655,{"$error":"#N/A"},{"$error":"#N/A"},{"$error":"#N/A"},{"$error":"#N/A"},211.19999999999655,{"$error":"#N/A"},{"$error":"#N/A"},{"$error":"#N/A"},{"$error":"#N/A"},211.19999999999655,{"$error":"#N/A"},{"$error":"#N/A"},{"$error":"#N/A"}]
[{"$nulls":5},{"$error":"#N/A"},211.39999999999654,{"$error":"#N/A"},{"$error":"#N/A"},{"$error":"#N/A"},{"$error":"#N/A"},211.39999999999654,{"$error":"#N/A"},{"$error":"#N/A"},{"$error":"#N/A"},{"$error":"#N/A"},211.39999999999654,{"$error":"#N/A"},{"$error":"#N/A"},{"$error":"#N/A"}]
[{"$nulls":5},{"$error":"#N/A"},211.59999999999653,{"$error":"#N/A"},{"$error":"#N/A"},{"$error":"#N/A"},{"$error":"#N/A"},211.59999999999653,{"$error":"#N/A"},{"$error":"#N/A"},{"$error":"#N/A"},{"$error":"#N/A"},211.59999999999653,{"$error":"#N/A"},{"$error":"#N/A"},{"$error":"#N/A"}]
[{"$nulls":5},{"$error":"#N/A"},211.79999999999652,{"$error":"#N/A"},{"$error":"#N/A"},{"$error":"#N/A"},{"$error":"#N/A"},211.79999999999652,{"$error":"#N/A"},{"$error":"#N/A"},{"$error":"#N/A"},{"$error":"#N/A"},211.79999999999652,{"$error":"#N/A"},{"$error":"#N/A"},{"$error":"#N/A"}]
[{"$nulls":5},{"$f":"IF(F1062<$I$2,F1062+30,NA())","v":{"$error":"#N/A"}},{"$f":"G1062+$G$2","v":211.9999999999965},{"$f":"-1+COS(F1063*PI()/180)+G1063","v":{"$error":"#N/A"}},{"$f":"(F1063/$I$2)*($D$8-$D$7)+COS(F1063*PI()/180)+$D$7-1","v":{"$error":"#N/A"}},{"$f":"$J$2*SIN(F1063*PI()/180)+$B$18","v":{"$error":"#N/A"}},{"$error":"#N/A"},211.9999999999965,{"$f":"-1+COS(K1063*PI()/180)+L1063","v":{"$error":"#N/A"}},{"$f":"(K1063/$N$2)*($D$13-$D$12)+COS(K1063*PI()/180)+$D$12-1","v":{"$error":"#N/A"}},{"$f":"$O$2*SIN(K1063*PI()/180)+$B$19","v":{"$error":"#N/A"}},{"$error":"#N/A"},{"$f":"Q1062+$G$2","v":211.9999999999965},{"$f":"-1+COS(P1063*PI()/180)+Q1063","v":{"$error":"#N/A"}},{"$f":"(P1063/$S$2)*($D$18-$D$17)+COS(P1063*PI()/180)+$D$17-1","v":{"$error":"#N/A"}},{"$f":"$T$2*SIN(P1063*PI()/180)+$B$20","v":{"$error":"#N/A"}}]
[{"$nulls":5},{"$error":"#N/A"},212.1999999999965,{"$error":"#N/A"},{"$error":"#N/A"},{"$error":"#N/A"},{"$error":"#N/A"},212.1999999999965,{"$error":"#N/A"},{"$error":"#N/A"},{"$error":"#N/A"},{"$error":"#N/A"},212.1999999999965,{"$error":"#N/A"},{"$error":"#N/A"},{"$error":"#N/A"}]
[{"$nulls":5},{"$error":"#N/A"},212.39999999999648,{"$error":"#N/A"},{"$error":"#N/A"},{"$error":"#N/A"},{"$error":"#N/A"},212.39999999999648,{"$error":"#N/A"},{"$error":"#N/A"},{"$error":"#N/A"},{"$error":"#N/A"},212.39999999999648,{"$error":"#N/A"},{"$error":"#N/A"},{"$error":"#N/A"}]
[{"$nulls":5},{"$error":"#N/A"},212.59999999999647,{"$error":"#N/A"},{"$error":"#N/A"},{"$error":"#N/A"},{"$error":"#N/A"},212.59999999999647,{"$error":"#N/A"},{"$error":"#N/A"},{"$error":"#N/A"},{"$error":"#N/A"},212.59999999999647,{"$error":"#N/A"},{"$error":"#N/A"},{"$error":"#N/A"}]
[{"$nulls":5},{"$error":"#N/A"},212.79999999999646,{"$error":"#N/A"},{"$error":"#N/A"},{"$error":"#N/A"},{"$error":"#N/A"},212.79999999999646,{"$error":"#N/A"},{"$error":"#N/A"},{"$error":"#N/A"},{"$error":"#N/A"},212.79999999999646,{"$error":"#N/A"},{"$error":"#N/A"},{"$error":"#N/A"}]
[{"$nulls":5},{"$error":"#N/A"},212.99999999999645,{"$error":"#N/A"},{"$error":"#N/A"},{"$error":"#N/A"},{"$error":"#N/A"},212.99999999999645,{"$error":"#N/A"},{"$error":"#N/A"},{"$error":"#N/A"},{"$error":"#N/A"},212.99999999999645,{"$error":"#N/A"},{"$error":"#N/A"},{"$error":"#N/A"}]
[{"$nulls":5},{"$error":"#N/A"},213.19999999999644,{"$error":"#N/A"},{"$error":"#N/A"},{"$error":"#N/A"},{"$error":"#N/A"},213.19999999999644,{"$error":"#N/A"},{"$error":"#N/A"},{"$error":"#N/A"},{"$error":"#N/A"},213.19999999999644,{"$error":"#N/A"},{"$error":"#N/A"},{"$error":"#N/A"}]
[{"$nulls":5},{"$error":"#N/A"},213.39999999999642,{"$error":"#N/A"},{"$error":"#N/A"},{"$error":"#N/A"},{"$error":"#N/A"},213.39999999999642,{"$error":"#N/A"},{"$error":"#N/A"},{"$error":"#N/A"},{"$error":"#N/A"},213.39999999999642,{"$error":"#N/A"},{"$error":"#N/A"},{"$error":"#N/A"}]
[{"$nulls":5},{"$error":"#N/A"},213.5999999999964,{"$error":"#N/A"},{"$error":"#N/A"},{"$error":"#N/A"},{"$error":"#N/A"},213.5999999999964,{"$error":"#N/A"},{"$error":"#N/A"},{"$error":"#N/A"},{"$error":"#N/A"},213.5999999999964,{"$error":"#N/A"},{"$error":"#N/A"},{"$error":"#N/A"}]
[{"$nulls":5},{"$error":"#N/A"},213.7999999999964,{"$error":"#N/A"},{"$error":"#N/A"},{"$error":"#N/A"},{"$error":"#N/A"},213.7999999999964,{"$error":"#N/A"},{"$error":"#N/A"},{"$error":"#N/A"},{"$error":"#N/A"},213.7999999999964,{"$error":"#N/A"},{"$error":"#N/A"},{"$error":"#N/A"}]
[{"$nulls":5},{"$error":"#N/A"},213.9999999999964,{"$error":"#N/A"},{"$error":"#N/A"},{"$error":"#N/A"},{"$error":"#N/A"},213.9999999999964,{"$error":"#N/A"},{"$error":"#N/A"},{"$error":"#N/A"},{"$error":"#N/A"},213.9999999999964,{"$error":"#N/A"},{"$error":"#N/A"},{"$error":"#N/A"}]
[{"$nulls":5},{"$error":"#N/A"},214.19999999999638,{"$error":"#N/A"},{"$error":"#N/A"},{"$error":"#N/A"},{"$error":"#N/A"},214.19999999999638,{"$error":"#N/A"},{"$error":"#N/A"},{"$error":"#N/A"},{"$error":"#N/A"},214.19999999999638,{"$error":"#N/A"},{"$error":"#N/A"},{"$error":"#N/A"}]
[{"$nulls":5},{"$error":"#N/A"},214.39999999999637,{"$error":"#N/A"},{"$error":"#N/A"},{"$error":"#N/A"},{"$error":"#N/A"},214.39999999999637,{"$error":"#N/A"},{"$error":"#N/A"},{"$error":"#N/A"},{"$error":"#N/A"},214.39999999999637,{"$error":"#N/A"},{"$error":"#N/A"},{"$error":"#N/A"}]
[{"$nulls":5},{"$error":"#N/A"},214.59999999999636,{"$error":"#N/A"},{"$error":"#N/A"},{"$error":"#N/A"},{"$error":"#N/A"},214.59999999999636,{"$error":"#N/A"},{"$error":"#N/A"},{"$error":"#N/A"},{"$error":"#N/A"},214.59999999999636,{"$error":"#N/A"},{"$error":"#N/A"},{"$error":"#N/A"}]
[{"$nulls":5},{"$error":"#N/A"},214.79999999999634,{"$error":"#N/A"},{"$error":"#N/A"},{"$error":"#N/A"},{"$error":"#N/A"},214.79999999999634,{"$error":"#N/A"},{"$error":"#N/A"},{"$error":"#N/A"},{"$error":"#N/A"},214.79999999999634,{"$error":"#N/A"},{"$error":"#N/A"},{"$error":"#N/A"}]
[{"$nulls":5},{"$error":"#N/A"},214.99999999999633,{"$error":"#N/A"},{"$error":"#N/A"},{"$error":"#N/A"},{"$error":"#N/A"},214.99999999999633,{"$error":"#N/A"},{"$error":"#N/A"},{"$error":"#N/A"},{"$error":"#N/A"},214.99999999999633,{"$error":"#N/A"},{"$error":"#N/A"},{"$error":"#N/A"}]
[{"$nulls":5},{"$error":"#N/A"},215.19999999999632,{"$error":"#N/A"},{"$error":"#N/A"},{"$error":"#N/A"},{"$error":"#N/A"},215.19999999999632,{"$error":"#N/A"},{"$error":"#N/A"},{"$error":"#N/A"},{"$error":"#N/A"},215.19999999999632,{"$error":"#N/A"},{"$error":"#N/A"},{"$error":"#N/A"}]
[{"$nulls":5},{"$error":"#N/A"},215.3999999999963,{"$error":"#N/A"},{"$error":"#N/A"},{"$error":"#N/A"},{"$error":"#N/A"},215.3999999999963,{"$error":"#N/A"},{"$error":"#N/A"},{"$error":"#N/A"},{"$error":"#N/A"},215.3999999999963,{"$error":"#N/A"},{"$error":"#N/A"},{"$error":"#N/A"}]
[{"$nulls":5},{"$error":"#N/A"},215.5999999999963,{"$error":"#N/A"},{"$error":"#N/A"},{"$error":"#N/A"},{"$error":"#N/A"},215.5999999999963,{"$error":"#N/A"},{"$error":"#N/A"},{"$error":"#N/A"},{"$error":"#N/A"},215.5999999999963,{"$error":"#N/A"},{"$error":"#N/A"},{"$error":"#N/A"}]
[{"$nulls":5},{"$error":"#N/A"},215.7999999999963,{"$error":"#N/A"},{"$error":"#N/A"},{"$error":"#N/A"},{"$error":"#N/A"},215.7999999999963,{"$error":"#N/A"},{"$error":"#N/A"},{"$error":"#N/A"},{"$error":"#N/A"},215.7999999999963,{"$error":"#N/A"},{"$error":"#N/A"},{"$error":"#N/A"}]
[{"$nulls":5},{"$error":"#N/A"},215.99999999999628,{"$error":"#N/A"},{"$error":"#N/A"},{"$error":"#N/A"},{"$error":"#N/A"},215.99999999999628,{"$error":"#N/A"},{"$error":"#N/A"},{"$error":"#N/A"},{"$error":"#N/A"},215.99999999999628,{"$error":"#N/A"},{"$error":"#N/A"},{"$error":"#N/A"}]
[{"$nulls":5},{"$error":"#N/A"},216.19999999999627,{"$error":"#N/A"},{"$error":"#N/A"},{"$error":"#N/A"},{"$error":"#N/A"},216.19999999999627,{"$error":"#N/A"},{"$error":"#N/A"},{"$error":"#N/A"},{"$error":"#N/A"},216.19999999999627,{"$error":"#N/A"},{"$error":"#N/A"},{"$error":"#N/A"}]
[{"$nulls":5},{"$error":"#N/A"},216.39999999999625,{"$error":"#N/A"},{"$error":"#N/A"},{"$error":"#N/A"},{"$error":"#N/A"},216.39999999999625,{"$error":"#N/A"},{"$error":"#N/A"},{"$error":"#N/A"},{"$error":"#N/A"},216.39999999999625,{"$error":"#N/A"},{"$error":"#N/A"},{"$error":"#N/A"}]
[{"$nulls":5},{"$error":"#N/A"},216.59999999999624,{"$error":"#N/A"},{"$error":"#N/A"},{"$error":"#N/A"},{"$error":"#N/A"},216.59999999999624,{"$error":"#N/A"},{"$error":"#N/A"},{"$error":"#N/A"},{"$error":"#N/A"},216.59999999999624,{"$error":"#N/A"},{"$error":"#N/A"},{"$error":"#N/A"}]
[{"$nulls":5},{"$error":"#N/A"},216.79999999999623,{"$error":"#N/A"},{"$error":"#N/A"},{"$error":"#N/A"},{"$error":"#N/A"},216.79999999999623,{"$error":"#N/A"},{"$error":"#N/A"},{"$error":"#N/A"},{"$error":"#N/A"},216.79999999999623,{"$error":"#N/A"},{"$error":"#N/A"},{"$error":"#N/A"}]
[{"$nulls":5},{"$error":"#N/A"},216.99999999999622,{"$error":"#N/A"},{"$error":"#N/A"},{"$error":"#N/A"},{"$error":"#N/A"},216.99999999999622,{"$error":"#N/A"},{"$error":"#N/A"},{"$error":"#N/A"},{"$error":"#N/A"},216.99999999999622,{"$error":"#N/A"},{"$error":"#N/A"},{"$error":"#N/A"}]
[{"$nulls":5},{"$error":"#N/A"},217.1999999999962,{"$error":"#N/A"},{"$error":"#N/A"},{"$error":"#N/A"},{"$error":"#N/A"},217.1999999999962,{"$error":"#N/A"},{"$error":"#N/A"},{"$error":"#N/A"},{"$error":"#N/A"},217.1999999999962,{"$error":"#N/A"},{"$error":"#N/A"},{"$error":"#N/A"}]
[{"$nulls":5},{"$error":"#N/A"},217.3999999999962,{"$error":"#N/A"},{"$error":"#N/A"},{"$error":"#N/A"},{"$error":"#N/A"},217.3999999999962,{"$error":"#N/A"},{"$error":"#N/A"},{"$error":"#N/A"},{"$error":"#N/A"},217.3999999999962,{"$error":"#N/A"},{"$error":"#N/A"},{"$error":"#N/A"}]
[{"$nulls":5},{"$error":"#N/A"},217.5999999999962,{"$error":"#N/A"},{"$error":"#N/A"},{"$error":"#N/A"},{"$error":"#N/A"},217.5999999999962,{"$error":"#N/A"},{"$error":"#N/A"},{"$error":"#N/A"},{"$error":"#N/A"},217.5999999999962,{"$error":"#N/A"},{"$error":"#N/A"},{"$error":"#N/A"}]
[{"$nulls":5},{"$error":"#N/A"},217.79999999999617,{"$error":"#N/A"},{"$error":"#N/A"},{"$error":"#N/A"},{"$error":"#N/A"},217.79999999999617,{"$error":"#N/A"},{"$error":"#N/A"},{"$error":"#N/A"},{"$error":"#N/A"},217.79999999999617,{"$error":"#N/A"},{"$error":"#N/A"},{"$error":"#N/A"}]
[{"$nulls":5},{"$error":"#N/A"},217.99999999999616,{"$error":"#N/A"},{"$error":"#N/A"},{"$error":"#N/A"},{"$f":"IF(K1092<$N$2,K1092+30,NA())","v":{"$error":"#N/A"}},{"$f":"L1092+$L$2","v":217.99999999999616},{"$error":"#N/A"},{"$error":"#N/A"},{"$error":"#N/A"},{"$f":"IF(P1092<$S$2,P1092+30,NA())","v":{"$error":"#N/A"}},217.99999999999616,{"$error":"#N/A"},{"$error":"#N/A"},{"$error":"#N/A"}]
[{"$nulls":5},{"$error":"#N/A"},218.19999999999615,{"$error":"#N/A"},{"$error":"#N/A"},{"$error":"#N/A"},{"$error":"#N/A"},218.19999999999615,{"$error":"#N/A"},{"$error":"#N/A"},{"$error":"#N/A"},{"$error":"#N/A"},218.19999999999615,{"$error":"#N/A"},{"$error":"#N/A"},{"$error":"#N/A"}]
[{"$nulls":5},{"$error":"#N/A"},218.39999999999614,{"$error":"#N/A"},{"$error":"#N/A"},{"$error":"#N/A"},{"$error":"#N/A"},218.39999999999614,{"$error":"#N/A"},{"$error":"#N/A"},{"$error":"#N/A"},{"$error":"#N/A"},218.39999999999614,{"$error":"#N/A"},{"$error":"#N/A"},{"$error":"#N/A"}]
[{"$nulls":5},{"$error":"#N/A"},218.59999999999613,{"$error":"#N/A"},{"$error":"#N/A"},{"$error":"#N/A"},{"$error":"#N/A"},218.59999999999613,{"$error":"#N/A"},{"$error":"#N/A"},{"$error":"#N/A"},{"$error":"#N/A"},218.59999999999613,{"$error":"#N/A"},{"$error":"#N/A"},{"$error":"#N/A"}]
[{"$nulls":5},{"$error":"#N/A"},218.79999999999612,{"$error":"#N/A"},{"$error":"#N/A"},{"$error":"#N/A"},{"$error":"#N/A"},218.79999999999612,{"$error":"#N/A"},{"$error":"#N/A"},{"$error":"#N/A"},{"$error":"#N/A"},218.79999999999612,{"$error":"#N/A"},{"$error":"#N/A"},{"$error":"#N/A"}]
[{"$nulls":5},{"$error":"#N/A"},218.9999999999961,{"$error":"#N/A"},{"$error":"#N/A"},{"$error":"#N/A"},{"$error":"#N/A"},218.9999999999961,{"$error":"#N/A"},{"$error":"#N/A"},{"$error":"#N/A"},{"$error":"#N/A"},218.9999999999961,{"$error":"#N/A"},{"$error":"#N/A"},{"$error":"#N/A"}]
[{"$nulls":5},{"$error":"#N/A"},219.1999999999961,{"$error":"#N/A"},{"$error":"#N/A"},{"$error":"#N/A"},{"$error":"#N/A"},219.1999999999961,{"$error":"#N/A"},{"$error":"#N/A"},{"$error":"#N/A"},{"$error":"#N/A"},219.1999999999961,{"$error":"#N/A"},{"$error":"#N/A"},{"$error":"#N/A"}]
[{"$nulls":5},{"$error":"#N/A"},219.39999999999608,{"$error":"#N/A"},{"$error":"#N/A"},{"$error":"#N/A"},{"$error":"#N/A"},219.39999999999608,{"$error":"#N/A"},{"$error":"#N/A"},{"$error":"#N/A"},{"$error":"#N/A"},219.39999999999608,{"$error":"#N/A"},{"$error":"#N/A"},{"$error":"#N/A"}]
[{"$nulls":5},{"$error":"#N/A"},219.59999999999607,{"$error":"#N/A"},{"$error":"#N/A"},{"$error":"#N/A"},{"$error":"#N/A"},219.59999999999607,{"$error":"#N/A"},{"$error":"#N/A"},{"$error":"#N/A"},{"$error":"#N/A"},219.59999999999607,{"$error":"#N/A"},{"$error":"#N/A"},{"$error":"#N/A"}]
[{"$nulls":5},{"$error":"#N/A"},219.79999999999606,{"$error":"#N/A"},{"$error":"#N/A"},{"$error":"#N/A"},{"$error":"#N/A"},219.79999999999606,{"$error":"#N/A"},{"$error":"#N/A"},{"$error":"#N/A"},{"$error":"#N/A"},219.79999999999606,{"$error":"#N/A"},{"$error":"#N/A"},{"$error":"#N/A"}]
[{"$nulls":5},{"$error":"#N/A"},219.99999999999605,{"$error":"#N/A"},{"$error":"#N/A"},{"$error":"#N/A"},{"$error":"#N/A"},219.99999999999605,{"$error":"#N/A"},{"$error":"#N/A"},{"$error":"#N/A"},{"$error":"#N/A"},219.99999999999605,{"$error":"#N/A"},{"$error":"#N/A"},{"$error":"#N/A"}]
[{"$nulls":5},{"$error":"#N/A"},220.19999999999604,{"$error":"#N/A"},{"$error":"#N/A"},{"$error":"#N/A"},{"$error":"#N/A"},220.19999999999604,{"$error":"#N/A"},{"$error":"#N/A"},{"$error":"#N/A"},{"$error":"#N/A"},220.19999999999604,{"$error":"#N/A"},{"$error":"#N/A"},{"$error":"#N/A"}]
[{"$nulls":5},{"$error":"#N/A"},220.39999999999603,{"$error":"#N/A"},{"$error":"#N/A"},{"$error":"#N/A"},{"$error":"#N/A"},220.39999999999603,{"$error":"#N/A"},{"$error":"#N/A"},{"$error":"#N/A"},{"$error":"#N/A"},220.39999999999603,{"$error":"#N/A"},{"$error":"#N/A"},{"$error":"#N/A"}]
[{"$nulls":5},{"$error":"#N/A"},220.59999999999602,{"$error":"#N/A"},{"$error":"#N/A"},{"$error":"#N/A"},{"$error":"#N/A"},220.59999999999602,{"$error":"#N/A"},{"$error":"#N/A"},{"$error":"#N/A"},{"$error":"#N/A"},220.59999999999602,{"$error":"#N/A"},{"$error":"#N/A"},{"$error":"#N/A"}]
[{"$nulls":5},{"$error":"#N/A"},220.799999999996,{"$error":"#N/A"},{"$error":"#N/A"},{"$error":"#N/A"},{"$error":"#N/A"},220.799999999996,{"$error":"#N/A"},{"$error":"#N/A"},{"$error":"#N/A"},{"$error":"#N/A"},220.799999999996,{"$error":"#N/A"},{"$error":"#N/A"},{"$error":"#N/A"}]
[{"$nulls":5},{"$error":"#N/A"},220.999999999996,{"$error":"#N/A"},{"$error":"#N/A"},{"$error":"#N/A"},{"$error":"#N/A"},220.999999999996,{"$error":"#N/A"},{"$error":"#N/A"},{"$error":"#N/A"},{"$error":"#N/A"},220.999999999996,{"$error":"#N/A"},{"$error":"#N/A"},{"$error":"#N/A"}]
[{"$nulls":5},{"$error":"#N/A"},221.19999999999598,{"$error":"#N/A"},{"$error":"#N/A"},{"$error":"#N/A"},{"$error":"#N/A"},221.19999999999598,{"$error":"#N/A"},{"$error":"#N/A"},{"$error":"#N/A"},{"$error":"#N/A"},221.19999999999598,{"$error":"#N/A"},{"$error":"#N/A"},{"$error":"#N/A"}]
[{"$nulls":5},{"$error":"#N/A"},221.39999999999597,{"$error":"#N/A"},{"$error":"#N/A"},{"$error":"#N/A"},{"$error":"#N/A"},221.39999999999597,{"$error":"#N/A"},{"$error":"#N/A"},{"$error":"#N/A"},{"$error":"#N/A"},221.39999999999597,{"$error":"#N/A"},{"$error":"#N/A"},{"$error":"#N/A"}]
[{"$nulls":5},{"$error":"#N/A"},221.59999999999596,{"$error":"#N/A"},{"$error":"#N/A"},{"$error":"#N/A"},{"$error":"#N/A"},221.59999999999596,{"$error":"#N/A"},{"$error":"#N/A"},{"$error":"#N/A"},{"$error":"#N/A"},221.59999999999596,{"$error":"#N/A"},{"$error":"#N/A"},{"$error":"#N/A"}]
[{"$nulls":5},{"$error":"#N/A"},221.79999999999595,{"$error":"#N/A"},{"$error":"#N/A"},{"$error":"#N/A"},{"$error":"#N/A"},221.79999999999595,{"$error":"#N/A"},{"$error":"#N/A"},{"$error":"#N/A"},{"$error":"#N/A"},221.79999999999595,{"$error":"#N/A"},{"$error":"#N/A"},{"$error":"#N/A"}]
[{"$nulls":5},{"$error":"#N/A"},221.99999999999594,{"$error":"#N/A"},{"$error":"#N/A"},{"$error":"#N/A"},{"$error":"#N/A"},221.99999999999594,{"$error":"#N/A"},{"$error":"#N/A"},{"$error":"#N/A"},{"$error":"#N/A"},221.99999999999594,{"$error":"#N/A"},{"$error":"#N/A"},{"$error":"#N/A"}]
[{"$nulls":5},{"$error":"#N/A"},222.19999999999592,{"$error":"#N/A"},{"$error":"#N/A"},{"$error":"#N/A"},{"$error":"#N/A"},222.19999999999592,{"$error":"#N/A"},{"$error":"#N/A"},{"$error":"#N/A"},{"$error":"#N/A"},222.19999999999592,{"$error":"#N/A"},{"$error":"#N/A"},{"$error":"#N/A"}]
[{"$nulls":5},{"$error":"#N/A"},222.3999999999959,{"$error":"#N/A"},{"$error":"#N/A"},{"$error":"#N/A"},{"$error":"#N/A"},222.3999999999959,{"$error":"#N/A"},{"$error":"#N/A"},{"$error":"#N/A"},{"$error":"#N/A"},222.3999999999959,{"$error":"#N/A"},{"$error":"#N/A"},{"$error":"#N/A"}]
[{"$nulls":5},{"$error":"#N/A"},222.5999999999959,{"$error":"#N/A"},{"$error":"#N/A"},{"$error":"#N/A"},{"$error":"#N/A"},222.5999999999959,{"$error":"#N/A"},{"$error":"#N/A"},{"$error":"#N/A"},{"$error":"#N/A"},222.5999999999959,{"$error":"#N/A"},{"$error":"#N/A"},{"$error":"#N/A"}]
[{"$nulls":5},{"$error":"#N/A"},222.7999999999959,{"$error":"#N/A"},{"$error":"#N/A"},{"$error":"#N/A"},{"$error":"#N/A"},222.7999999999959,{"$error":"#N/A"},{"$error":"#N/A"},{"$error":"#N/A"},{"$error":"#N/A"},222.7999999999959,{"$error":"#N/A"},{"$error":"#N/A"},{"$error":"#N/A"}]
[{"$nulls":5},{"$error":"#N/A"},222.99999999999588,{"$error":"#N/A"},{"$error":"#N/A"},{"$error":"#N/A"},{"$error":"#N/A"},222.99999999999588,{"$error":"#N/A"},{"$error":"#N/A"},{"$error":"#N/A"},{"$error":"#N/A"},222.99999999999588,{"$error":"#N/A"},{"$error":"#N/A"},{"$error":"#N/A"}]
[{"$nulls":5},{"$error":"#N/A"},223.19999999999587,{"$error":"#N/A"},{"$error":"#N/A"},{"$error":"#N/A"},{"$error":"#N/A"},223.19999999999587,{"$error":"#N/A"},{"$error":"#N/A"},{"$error":"#N/A"},{"$error":"#N/A"},223.19999999999587,{"$error":"#N/A"},{"$error":"#N/A"},{"$error":"#N/A"}]
[{"$nulls":5},{"$error":"#N/A"},223.39999999999586,{"$error":"#N/A"},{"$error":"#N/A"},{"$error":"#N/A"},{"$error":"#N/A"},223.39999999999586,{"$error":"#N/A"},{"$error":"#N/A"},{"$error":"#N/A"},{"$error":"#N/A"},223.39999999999586,{"$error":"#N/A"},{"$error":"#N/A"},{"$error":"#N/A"}]
[{"$nulls":5},{"$error":"#N/A"},223.59999999999584,{"$error":"#N/A"},{"$error":"#N/A"},{"$error":"#N/A"},{"$error":"#N/A"},223.59999999999584,{"$error":"#N/A"},{"$error":"#N/A"},{"$error":"#N/A"},{"$error":"#N/A"},223.59999999999584,{"$error":"#N/A"},{"$error":"#N/A"},{"$error":"#N/A"}]
[{"$nulls":5},{"$error":"#N/A"},223.79999999999583,{"$error":"#N/A"},{"$error":"#N/A"},{"$error":"#N/A"},{"$error":"#N/A"},223.79999999999583,{"$error":"#N/A"},{"$error":"#N/A"},{"$error":"#N/A"},{"$error":"#N/A"},223.79999999999583,{"$error":"#N/A"},{"$error":"#N/A"},{"$error":"#N/A"}]
[{"$nulls":5},{"$error":"#N/A"},223.99999999999582,{"$error":"#N/A"},{"$error":"#N/A"},{"$error":"#N/A"},{"$error":"#N/A"},223.99999999999582,{"$error":"#N/A"},{"$error":"#N/A"},{"$error":"#N/A"},{"$error":"#N/A"},223.99999999999582,{"$error":"#N/A"},{"$error":"#N/A"},{"$error":"#N/A"}]
[{"$nulls":5},{"$error":"#N/A"},224.1999999999958,{"$error":"#N/A"},{"$error":"#N/A"},{"$error":"#N/A"},{"$error":"#N/A"},224.1999999999958,{"$error":"#N/A"},{"$error":"#N/A"},{"$error":"#N/A"},{"$error":"#N/A"},224.1999999999958,{"$error":"#N/A"},{"$error":"#N/A"},{"$error":"#N/A"}]
[{"$nulls":5},{"$error":"#N/A"},224.3999999999958,{"$error":"#N/A"},{"$error":"#N/A"},{"$error":"#N/A"},{"$error":"#N/A"},224.3999999999958,{"$error":"#N/A"},{"$error":"#N/A"},{"$error":"#N/A"},{"$error":"#N/A"},224.3999999999958,{"$error":"#N/A"},{"$error":"#N/A"},{"$error":"#N/A"}]
[{"$nulls":5},{"$error":"#N/A"},224.5999999999958,{"$error":"#N/A"},{"$error":"#N/A"},{"$error":"#N/A"},{"$error":"#N/A"},224.5999999999958,{"$error":"#N/A"},{"$error":"#N/A"},{"$error":"#N/A"},{"$error":"#N/A"},224.5999999999958,{"$error":"#N/A"},{"$error":"#N/A"},{"$error":"#N/A"}]
[{"$nulls":5},{"$f":"IF(F1126<$I$2,F1126+30,NA())","v":{"$error":"#N/A"}},{"$f":"G1126+$G$2","v":224.79999999999578},{"$f":"-1+COS(F1127*PI()/180)+G1127","v":{"$error":"#N/A"}},{"$f":"(F1127/$I$2)*($D$8-$D$7)+COS(F1127*PI()/180)+$D$7-1","v":{"$error":"#N/A"}},{"$f":"$J$2*SIN(F1127*PI()/180)+$B$18","v":{"$error":"#N/A"}},{"$error":"#N/A"},224.79999999999578,{"$f":"-1+COS(K1127*PI()/180)+L1127","v":{"$error":"#N/A"}},{"$f":"(K1127/$N$2)*($D$13-$D$12)+COS(K1127*PI()/180)+$D$12-1","v":{"$error":"#N/A"}},{"$f":"$O$2*SIN(K1127*PI()/180)+$B$19","v":{"$error":"#N/A"}},{"$error":"#N/A"},{"$f":"Q1126+$G$2","v":224.79999999999578},{"$f":"-1+COS(P1127*PI()/180)+Q1127","v":{"$error":"#N/A"}},{"$f":"(P1127/$S$2)*($D$18-$D$17)+COS(P1127*PI()/180)+$D$17-1","v":{"$error":"#N/A"}},{"$f":"$T$2*SIN(P1127*PI()/180)+$B$20","v":{"$error":"#N/A"}}]
[{"$nulls":5},{"$error":"#N/A"},224.99999999999577,{"$error":"#N/A"},{"$error":"#N/A"},{"$error":"#N/A"},{"$error":"#N/A"},224.99999999999577,{"$error":"#N/A"},{"$error":"#N/A"},{"$error":"#N/A"},{"$error":"#N/A"},224.99999999999577,{"$error":"#N/A"},{"$error":"#N/A"},{"$error":"#N/A"}]
[{"$nulls":5},{"$error":"#N/A"},225.19999999999575,{"$error":"#N/A"},{"$error":"#N/A"},{"$error":"#N/A"},{"$error":"#N/A"},225.19999999999575,{"$error":"#N/A"},{"$error":"#N/A"},{"$error":"#N/A"},{"$error":"#N/A"},225.19999999999575,{"$error":"#N/A"},{"$error":"#N/A"},{"$error":"#N/A"}]
[{"$nulls":5},{"$error":"#N/A"},225.39999999999574,{"$error":"#N/A"},{"$error":"#N/A"},{"$error":"#N/A"},{"$error":"#N/A"},225.39999999999574,{"$error":"#N/A"},{"$error":"#N/A"},{"$error":"#N/A"},{"$error":"#N/A"},225.39999999999574,{"$error":"#N/A"},{"$error":"#N/A"},{"$error":"#N/A"}]
[{"$nulls":5},{"$error":"#N/A"},225.59999999999573,{"$error":"#N/A"},{"$error":"#N/A"},{"$error":"#N/A"},{"$error":"#N/A"},225.59999999999573,{"$error":"#N/A"},{"$error":"#N/A"},{"$error":"#N/A"},{"$error":"#N/A"},225.59999999999573,{"$error":"#N/A"},{"$error":"#N/A"},{"$error":"#N/A"}]
[{"$nulls":5},{"$error":"#N/A"},225.79999999999572,{"$error":"#N/A"},{"$error":"#N/A"},{"$error":"#N/A"},{"$error":"#N/A"},225.79999999999572,{"$error":"#N/A"},{"$error":"#N/A"},{"$error":"#N/A"},{"$error":"#N/A"},225.79999999999572,{"$error":"#N/A"},{"$error":"#N/A"},{"$error":"#N/A"}]
[{"$nulls":5},{"$error":"#N/A"},225.9999999999957,{"$error":"#N/A"},{"$error":"#N/A"},{"$error":"#N/A"},{"$error":"#N/A"},225.9999999999957,{"$error":"#N/A"},{"$error":"#N/A"},{"$error":"#N/A"},{"$error":"#N/A"},225.9999999999957,{"$error":"#N/A"},{"$error":"#N/A"},{"$error":"#N/A"}]
[{"$nulls":5},{"$error":"#N/A"},226.1999999999957,{"$error":"#N/A"},{"$error":"#N/A"},{"$error":"#N/A"},{"$error":"#N/A"},226.1999999999957,{"$error":"#N/A"},{"$error":"#N/A"},{"$error":"#N/A"},{"$error":"#N/A"},226.1999999999957,{"$error":"#N/A"},{"$error":"#N/A"},{"$error":"#N/A"}]
[{"$nulls":5},{"$error":"#N/A"},226.39999999999569,{"$error":"#N/A"},{"$error":"#N/A"},{"$error":"#N/A"},{"$error":"#N/A"},226.39999999999569,{"$error":"#N/A"},{"$error":"#N/A"},{"$error":"#N/A"},{"$error":"#N/A"},226.39999999999569,{"$error":"#N/A"},{"$error":"#N/A"},{"$error":"#N/A"}]
[{"$nulls":5},{"$error":"#N/A"},226.59999999999567,{"$error":"#N/A"},{"$error":"#N/A"},{"$error":"#N/A"},{"$error":"#N/A"},226.59999999999567,{"$error":"#N/A"},{"$error":"#N/A"},{"$error":"#N/A"},{"$error":"#N/A"},226.59999999999567,{"$error":"#N/A"},{"$error":"#N/A"},{"$error":"#N/A"}]
[{"$nulls":5},{"$error":"#N/A"},226.79999999999566,{"$error":"#N/A"},{"$error":"#N/A"},{"$error":"#N/A"},{"$error":"#N/A"},226.79999999999566,{"$error":"#N/A"},{"$error":"#N/A"},{"$error":"#N/A"},{"$error":"#N/A"},226.79999999999566,{"$error":"#N/A"},{"$error":"#N/A"},{"$error":"#N/A"}]
[{"$nulls":5},{"$error":"#N/A"},226.99999999999565,{"$error":"#N/A"},{"$error":"#N/A"},{"$error":"#N/A"},{"$error":"#N/A"},226.99999999999565,{"$error":"#N/A"},{"$error":"#N/A"},{"$error":"#N/A"},{"$error":"#N/A"},226.99999999999565,{"$error":"#N/A"},{"$error":"#N/A"},{"$error":"#N/A"}]
[{"$nulls":5},{"$error":"#N/A"},227.19999999999564,{"$error":"#N/A"},{"$error":"#N/A"},{"$error":"#N/A"},{"$error":"#N/A"},227.19999999999564,{"$error":"#N/A"},{"$error":"#N/A"},{"$error":"#N/A"},{"$error":"#N/A"},227.19999999999564,{"$error":"#N/A"},{"$error":"#N/A"},{"$error":"#N/A"}]
[{"$nulls":5},{"$error":"#N/A"},227.39999999999563,{"$error":"#N/A"},{"$error":"#N/A"},{"$error":"#N/A"},{"$error":"#N/A"},227.39999999999563,{"$error":"#N/A"},{"$error":"#N/A"},{"$error":"#N/A"},{"$error":"#N/A"},227.39999999999563,{"$error":"#N/A"},{"$error":"#N/A"},{"$error":"#N/A"}]
[{"$nulls":5},{"$error":"#N/A"},227.59999999999562,{"$error":"#N/A"},{"$error":"#N/A"},{"$error":"#N/A"},{"$error":"#N/A"},227.59999999999562,{"$error":"#N/A"},{"$error":"#N/A"},{"$error":"#N/A"},{"$error":"#N/A"},227.59999999999562,{"$error":"#N/A"},{"$error":"#N/A"},{"$error":"#N/A"}]
[{"$nulls":5},{"$error":"#N/A"},227.7999999999956,{"$error":"#N/A"},{"$error":"#N/A"},{"$error":"#N/A"},{"$error":"#N/A"},227.7999999999956,{"$error":"#N/A"},{"$error":"#N/A"},{"$error":"#N/A"},{"$error":"#N/A"},227.7999999999956,{"$error":"#N/A"},{"$error":"#N/A"},{"$error":"#N/A"}]
[{"$nulls":5},{"$error":"#N/A"},227.9999999999956,{"$error":"#N/A"},{"$error":"#N/A"},{"$error":"#N/A"},{"$error":"#N/A"},227.9999999999956,{"$error":"#N/A"},{"$error":"#N/A"},{"$error":"#N/A"},{"$error":"#N/A"},227.9999999999956,{"$error":"#N/A"},{"$error":"#N/A"},{"$error":"#N/A"}]
[{"$nulls":5},{"$error":"#N/A"},228.19999999999558,{"$error":"#N/A"},{"$error":"#N/A"},{"$error":"#N/A"},{"$error":"#N/A"},228.19999999999558,{"$error":"#N/A"},{"$error":"#N/A"},{"$error":"#N/A"},{"$error":"#N/A"},228.19999999999558,{"$error":"#N/A"},{"$error":"#N/A"},{"$error":"#N/A"}]
[{"$nulls":5},{"$error":"#N/A"},228.39999999999557,{"$error":"#N/A"},{"$error":"#N/A"},{"$error":"#N/A"},{"$error":"#N/A"},228.39999999999557,{"$error":"#N/A"},{"$error":"#N/A"},{"$error":"#N/A"},{"$error":"#N/A"},228.39999999999557,{"$error":"#N/A"},{"$error":"#N/A"},{"$error":"#N/A"}]
[{"$nulls":5},{"$error":"#N/A"},228.59999999999556,{"$error":"#N/A"},{"$error":"#N/A"},{"$error":"#N/A"},{"$error":"#N/A"},228.59999999999556,{"$error":"#N/A"},{"$error":"#N/A"},{"$error":"#N/A"},{"$error":"#N/A"},228.59999999999556,{"$error":"#N/A"},{"$error":"#N/A"},{"$error":"#N/A"}]
[{"$nulls":5},{"$error":"#N/A"},228.79999999999555,{"$error":"#N/A"},{"$error":"#N/A"},{"$error":"#N/A"},{"$error":"#N/A"},228.79999999999555,{"$error":"#N/A"},{"$error":"#N/A"},{"$error":"#N/A"},{"$error":"#N/A"},228.79999999999555,{"$error":"#N/A"},{"$error":"#N/A"},{"$error":"#N/A"}]
[{"$nulls":5},{"$error":"#N/A"},228.99999999999554,{"$error":"#N/A"},{"$error":"#N/A"},{"$error":"#N/A"},{"$error":"#N/A"},228.99999999999554,{"$error":"#N/A"},{"$error":"#N/A"},{"$error":"#N/A"},{"$error":"#N/A"},228.99999999999554,{"$error":"#N/A"},{"$error":"#N/A"},{"$error":"#N/A"}]
[{"$nulls":5},{"$error":"#N/A"},229.19999999999553,{"$error":"#N/A"},{"$error":"#N/A"},{"$error":"#N/A"},{"$error":"#N/A"},229.19999999999553,{"$error":"#N/A"},{"$error":"#N/A"},{"$error":"#N/A"},{"$error":"#N/A"},229.19999999999553,{"$error":"#N/A"},{"$error":"#N/A"},{"$error":"#N/A"}]
[{"$nulls":5},{"$error":"#N/A"},229.39999999999552,{"$error":"#N/A"},{"$error":"#N/A"},{"$error":"#N/A"},{"$error":"#N/A"},229.39999999999552,{"$error":"#N/A"},{"$error":"#N/A"},{"$error":"#N/A"},{"$error":"#N/A"},229.39999999999552,{"$error":"#N/A"},{"$error":"#N/A"},{"$error":"#N/A"}]
[{"$nulls":5},{"$error":"#N/A"},229.5999999999955,{"$error":"#N/A"},{"$error":"#N/A"},{"$error":"#N/A"},{"$error":"#N/A"},229.5999999999955,{"$error":"#N/A"},{"$error":"#N/A"},{"$error":"#N/A"},{"$error":"#N/A"},229.5999999999955,{"$error":"#N/A"},{"$error":"#N/A"},{"$error":"#N/A"}]
[{"$nulls":5},{"$error":"#N/A"},229.7999999999955,{"$error":"#N/A"},{"$error":"#N/A"},{"$error":"#N/A"},{"$error":"#N/A"},229.7999999999955,{"$error":"#N/A"},{"$error":"#N/A"},{"$error":"#N/A"},{"$error":"#N/A"},229.7999999999955,{"$error":"#N/A"},{"$error":"#N/A"},{"$error":"#N/A"}]
[{"$nulls":5},{"$error":"#N/A"},229.99999999999548,{"$error":"#N/A"},{"$error":"#N/A"},{"$error":"#N/A"},{"$error":"#N/A"},229.99999999999548,{"$error":"#N/A"},{"$error":"#N/A"},{"$error":"#N/A"},{"$error":"#N/A"},229.99999999999548,{"$error":"#N/A"},{"$error":"#N/A"},{"$error":"#N/A"}]
[{"$nulls":5},{"$error":"#N/A"},230.19999999999547,{"$error":"#N/A"},{"$error":"#N/A"},{"$error":"#N/A"},{"$error":"#N/A"},230.19999999999547,{"$error":"#N/A"},{"$error":"#N/A"},{"$error":"#N/A"},{"$error":"#N/A"},230.19999999999547,{"$error":"#N/A"},{"$error":"#N/A"},{"$error":"#N/A"}]
[{"$nulls":5},{"$error":"#N/A"},230.39999999999546,{"$error":"#N/A"},{"$error":"#N/A"},{"$error":"#N/A"},{"$error":"#N/A"},230.39999999999546,{"$error":"#N/A"},{"$error":"#N/A"},{"$error":"#N/A"},{"$error":"#N/A"},230.39999999999546,{"$error":"#N/A"},{"$error":"#N/A"},{"$error":"#N/A"}]
[{"$nulls":5},{"$error":"#N/A"},230.59999999999545,{"$error":"#N/A"},{"$error":"#N/A"},{"$error":"#N/A"},{"$error":"#N/A"},230.59999999999545,{"$error":"#N/A"},{"$error":"#N/A"},{"$error":"#N/A"},{"$error":"#N/A"},230.59999999999545,{"$error":"#N/A"},{"$error":"#N/A"},{"$error":"#N/A"}]
[{"$nulls":5},{"$error":"#N/A"},230.79999999999544,{"$error":"#N/A"},{"$error":"#N/A"},{"$error":"#N/A"},{"$f":"IF(K1156<$N$2,K1156+30,NA())","v":{"$error":"#N/A"}},{"$f":"L1156+$L$2","v":230.79999999999544},{"$error":"#N/A"},{"$error":"#N/A"},{"$error":"#N/A"},{"$f":"IF(P1156<$S$2,P1156+30,NA())","v":{"$error":"#N/A"}},230.79999999999544,{"$error":"#N/A"},{"$error":"#N/A"},{"$error":"#N/A"}]
[{"$nulls":5},{"$error":"#N/A"},230.99999999999542,{"$error":"#N/A"},{"$error":"#N/A"},{"$error":"#N/A"},{"$error":"#N/A"},230.99999999999542,{"$error":"#N/A"},{"$error":"#N/A"},{"$error":"#N/A"},{"$error":"#N/A"},230.99999999999542,{"$error":"#N/A"},{"$error":"#N/A"},{"$error":"#N/A"}]
[{"$nulls":5},{"$error":"#N/A"},231.1999999999954,{"$error":"#N/A"},{"$error":"#N/A"},{"$error":"#N/A"},{"$error":"#N/A"},231.1999999999954,{"$error":"#N/A"},{"$error":"#N/A"},{"$error":"#N/A"},{"$error":"#N/A"},231.1999999999954,{"$error":"#N/A"},{"$error":"#N/A"},{"$error":"#N/A"}]
[{"$nulls":5},{"$error":"#N/A"},231.3999999999954,{"$error":"#N/A"},{"$error":"#N/A"},{"$error":"#N/A"},{"$error":"#N/A"},231.3999999999954,{"$error":"#N/A"},{"$error":"#N/A"},{"$error":"#N/A"},{"$error":"#N/A"},231.3999999999954,{"$error":"#N/A"},{"$error":"#N/A"},{"$error":"#N/A"}]
[{"$nulls":5},{"$error":"#N/A"},231.5999999999954,{"$error":"#N/A"},{"$error":"#N/A"},{"$error":"#N/A"},{"$error":"#N/A"},231.5999999999954,{"$error":"#N/A"},{"$error":"#N/A"},{"$error":"#N/A"},{"$error":"#N/A"},231.5999999999954,{"$error":"#N/A"},{"$error":"#N/A"},{"$error":"#N/A"}]
[{"$nulls":5},{"$error":"#N/A"},231.79999999999538,{"$error":"#N/A"},{"$error":"#N/A"},{"$error":"#N/A"},{"$error":"#N/A"},231.79999999999538,{"$error":"#N/A"},{"$error":"#N/A"},{"$error":"#N/A"},{"$error":"#N/A"},231.79999999999538,{"$error":"#N/A"},{"$error":"#N/A"},{"$error":"#N/A"}]
[{"$nulls":5},{"$error":"#N/A"},231.99999999999537,{"$error":"#N/A"},{"$error":"#N/A"},{"$error":"#N/A"},{"$error":"#N/A"},231.99999999999537,{"$error":"#N/A"},{"$error":"#N/A"},{"$error":"#N/A"},{"$error":"#N/A"},231.99999999999537,{"$error":"#N/A"},{"$error":"#N/A"},{"$error":"#N/A"}]
[{"$nulls":5},{"$error":"#N/A"},232.19999999999536,{"$error":"#N/A"},{"$error":"#N/A"},{"$error":"#N/A"},{"$error":"#N/A"},232.19999999999536,{"$error":"#N/A"},{"$error":"#N/A"},{"$error":"#N/A"},{"$error":"#N/A"},232.19999999999536,{"$error":"#N/A"},{"$error":"#N/A"},{"$error":"#N/A"}]
[{"$nulls":5},{"$error":"#N/A"},232.39999999999534,{"$error":"#N/A"},{"$error":"#N/A"},{"$error":"#N/A"},{"$error":"#N/A"},232.39999999999534,{"$error":"#N/A"},{"$error":"#N/A"},{"$error":"#N/A"},{"$error":"#N/A"},232.39999999999534,{"$error":"#N/A"},{"$error":"#N/A"},{"$error":"#N/A"}]
[{"$nulls":5},{"$error":"#N/A"},232.59999999999533,{"$error":"#N/A"},{"$error":"#N/A"},{"$error":"#N/A"},{"$error":"#N/A"},232.59999999999533,{"$error":"#N/A"},{"$error":"#N/A"},{"$error":"#N/A"},{"$error":"#N/A"},232.59999999999533,{"$error":"#N/A"},{"$error":"#N/A"},{"$error":"#N/A"}]
[{"$nulls":5},{"$error":"#N/A"},232.79999999999532,{"$error":"#N/A"},{"$error":"#N/A"},{"$error":"#N/A"},{"$error":"#N/A"},232.79999999999532,{"$error":"#N/A"},{"$error":"#N/A"},{"$error":"#N/A"},{"$error":"#N/A"},232.79999999999532,{"$error":"#N/A"},{"$error":"#N/A"},{"$error":"#N/A"}]
[{"$nulls":5},{"$error":"#N/A"},232.9999999999953,{"$error":"#N/A"},{"$error":"#N/A"},{"$error":"#N/A"},{"$error":"#N/A"},232.9999999999953,{"$error":"#N/A"},{"$error":"#N/A"},{"$error":"#N/A"},{"$error":"#N/A"},232.9999999999953,{"$error":"#N/A"},{"$error":"#N/A"},{"$error":"#N/A"}]
[{"$nulls":5},{"$error":"#N/A"},233.1999999999953,{"$error":"#N/A"},{"$error":"#N/A"},{"$error":"#N/A"},{"$error":"#N/A"},233.1999999999953,{"$error":"#N/A"},{"$error":"#N/A"},{"$error":"#N/A"},{"$error":"#N/A"},233.1999999999953,{"$error":"#N/A"},{"$error":"#N/A"},{"$error":"#N/A"}]
[{"$nulls":5},{"$error":"#N/A"},233.3999999999953,{"$error":"#N/A"},{"$error":"#N/A"},{"$error":"#N/A"},{"$error":"#N/A"},233.3999999999953,{"$error":"#N/A"},{"$error":"#N/A"},{"$error":"#N/A"},{"$error":"#N/A"},233.3999999999953,{"$error":"#N/A"},{"$error":"#N/A"},{"$error":"#N/A"}]
[{"$nulls":5},{"$error":"#N/A"},233.59999999999528,{"$error":"#N/A"},{"$error":"#N/A"},{"$error":"#N/A"},{"$error":"#N/A"},233.59999999999528,{"$error":"#N/A"},{"$error":"#N/A"},{"$error":"#N/A"},{"$error":"#N/A"},233.59999999999528,{"$error":"#N/A"},{"$error":"#N/A"},{"$error":"#N/A"}]
[{"$nulls":5},{"$error":"#N/A"},233.79999999999526,{"$error":"#N/A"},{"$error":"#N/A"},{"$error":"#N/A"},{"$error":"#N/A"},233.79999999999526,{"$error":"#N/A"},{"$error":"#N/A"},{"$error":"#N/A"},{"$error":"#N/A"},233.79999999999526,{"$error":"#N/A"},{"$error":"#N/A"},{"$error":"#N/A"}]
[{"$nulls":5},{"$error":"#N/A"},233.99999999999525,{"$error":"#N/A"},{"$error":"#N/A"},{"$error":"#N/A"},{"$error":"#N/A"},233.99999999999525,{"$error":"#N/A"},{"$error":"#N/A"},{"$error":"#N/A"},{"$error":"#N/A"},233.99999999999525,{"$error":"#N/A"},{"$error":"#N/A"},{"$error":"#N/A"}]
[{"$nulls":5},{"$error":"#N/A"},234.19999999999524,{"$error":"#N/A"},{"$error":"#N/A"},{"$error":"#N/A"},{"$error":"#N/A"},234.19999999999524,{"$error":"#N/A"},{"$error":"#N/A"},{"$error":"#N/A"},{"$error":"#N/A"},234.19999999999524,{"$error":"#N/A"},{"$error":"#N/A"},{"$error":"#N/A"}]
[{"$nulls":5},{"$error":"#N/A"},234.39999999999523,{"$error":"#N/A"},{"$error":"#N/A"},{"$error":"#N/A"},{"$error":"#N/A"},234.39999999999523,{"$error":"#N/A"},{"$error":"#N/A"},{"$error":"#N/A"},{"$error":"#N/A"},234.39999999999523,{"$error":"#N/A"},{"$error":"#N/A"},{"$error":"#N/A"}]
[{"$nulls":5},{"$error":"#N/A"},234.59999999999522,{"$error":"#N/A"},{"$error":"#N/A"},{"$error":"#N/A"},{"$error":"#N/A"},234.59999999999522,{"$error":"#N/A"},{"$error":"#N/A"},{"$error":"#N/A"},{"$error":"#N/A"},234.59999999999522,{"$error":"#N/A"},{"$error":"#N/A"},{"$error":"#N/A"}]
[{"$nulls":5},{"$error":"#N/A"},234.7999999999952,{"$error":"#N/A"},{"$error":"#N/A"},{"$error":"#N/A"},{"$error":"#N/A"},234.7999999999952,{"$error":"#N/A"},{"$error":"#N/A"},{"$error":"#N/A"},{"$error":"#N/A"},234.7999999999952,{"$error":"#N/A"},{"$error":"#N/A"},{"$error":"#N/A"}]
[{"$nulls":5},{"$error":"#N/A"},234.9999999999952,{"$error":"#N/A"},{"$error":"#N/A"},{"$error":"#N/A"},{"$error":"#N/A"},234.9999999999952,{"$error":"#N/A"},{"$error":"#N/A"},{"$error":"#N/A"},{"$error":"#N/A"},234.9999999999952,{"$error":"#N/A"},{"$error":"#N/A"},{"$error":"#N/A"}]
[{"$nulls":5},{"$error":"#N/A"},235.19999999999519,{"$error":"#N/A"},{"$error":"#N/A"},{"$error":"#N/A"},{"$error":"#N/A"},235.19999999999519,{"$error":"#N/A"},{"$error":"#N/A"},{"$error":"#N/A"},{"$error":"#N/A"},235.19999999999519,{"$error":"#N/A"},{"$error":"#N/A"},{"$error":"#N/A"}]
[{"$nulls":5},{"$error":"#N/A"},235.39999999999517,{"$error":"#N/A"},{"$error":"#N/A"},{"$error":"#N/A"},{"$error":"#N/A"},235.39999999999517,{"$error":"#N/A"},{"$error":"#N/A"},{"$error":"#N/A"},{"$error":"#N/A"},235.39999999999517,{"$error":"#N/A"},{"$error":"#N/A"},{"$error":"#N/A"}]
[{"$nulls":5},{"$error":"#N/A"},235.59999999999516,{"$error":"#N/A"},{"$error":"#N/A"},{"$error":"#N/A"},{"$error":"#N/A"},235.59999999999516,{"$error":"#N/A"},{"$error":"#N/A"},{"$error":"#N/A"},{"$error":"#N/A"},235.59999999999516,{"$error":"#N/A"},{"$error":"#N/A"},{"$error":"#N/A"}]
[{"$nulls":5},{"$error":"#N/A"},235.79999999999515,{"$error":"#N/A"},{"$error":"#N/A"},{"$error":"#N/A"},{"$error":"#N/A"},235.79999999999515,{"$error":"#N/A"},{"$error":"#N/A"},{"$error":"#N/A"},{"$error":"#N/A"},235.79999999999515,{"$error":"#N/A"},{"$error":"#N/A"},{"$error":"#N/A"}]
[{"$nulls":5},{"$error":"#N/A"},235.99999999999514,{"$error":"#N/A"},{"$error":"#N/A"},{"$error":"#N/A"},{"$error":"#N/A"},235.99999999999514,{"$error":"#N/A"},{"$error":"#N/A"},{"$error":"#N/A"},{"$error":"#N/A"},235.99999999999514,{"$error":"#N/A"},{"$error":"#N/A"},{"$error":"#N/A"}]
[{"$nulls":5},{"$error":"#N/A"},236.19999999999513,{"$error":"#N/A"},{"$error":"#N/A"},{"$error":"#N/A"},{"$error":"#N/A"},236.19999999999513,{"$error":"#N/A"},{"$error":"#N/A"},{"$error":"#N/A"},{"$error":"#N/A"},236.19999999999513,{"$error":"#N/A"},{"$error":"#N/A"},{"$error":"#N/A"}]
[{"$nulls":5},{"$error":"#N/A"},236.39999999999512,{"$error":"#N/A"},{"$error":"#N/A"},{"$error":"#N/A"},{"$error":"#N/A"},236.39999999999512,{"$error":"#N/A"},{"$error":"#N/A"},{"$error":"#N/A"},{"$error":"#N/A"},236.39999999999512,{"$error":"#N/A"},{"$error":"#N/A"},{"$error":"#N/A"}]
[{"$nulls":5},{"$error":"#N/A"},236.5999999999951,{"$error":"#N/A"},{"$error":"#N/A"},{"$error":"#N/A"},{"$error":"#N/A"},236.5999999999951,{"$error":"#N/A"},{"$error":"#N/A"},{"$error":"#N/A"},{"$error":"#N/A"},236.5999999999951,{"$error":"#N/A"},{"$error":"#N/A"},{"$error":"#N/A"}]
[{"$nulls":5},{"$error":"#N/A"},236.7999999999951,{"$error":"#N/A"},{"$error":"#N/A"},{"$error":"#N/A"},{"$error":"#N/A"},236.7999999999951,{"$error":"#N/A"},{"$error":"#N/A"},{"$error":"#N/A"},{"$error":"#N/A"},236.7999999999951,{"$error":"#N/A"},{"$error":"#N/A"},{"$error":"#N/A"}]
[{"$nulls":5},{"$error":"#N/A"},236.99999999999508,{"$error":"#N/A"},{"$error":"#N/A"},{"$error":"#N/A"},{"$error":"#N/A"},236.99999999999508,{"$error":"#N/A"},{"$error":"#N/A"},{"$error":"#N/A"},{"$error":"#N/A"},236.99999999999508,{"$error":"#N/A"},{"$error":"#N/A"},{"$error":"#N/A"}]
[{"$nulls":5},{"$error":"#N/A"},237.19999999999507,{"$error":"#N/A"},{"$error":"#N/A"},{"$error":"#N/A"},{"$error":"#N/A"},237.19999999999507,{"$error":"#N/A"},{"$error":"#N/A"},{"$error":"#N/A"},{"$error":"#N/A"},237.19999999999507,{"$error":"#N/A"},{"$error":"#N/A"},{"$error":"#N/A"}]
[{"$nulls":5},{"$error":"#N/A"},237.39999999999506,{"$error":"#N/A"},{"$error":"#N/A"},{"$error":"#N/A"},{"$error":"#N/A"},237.39999999999506,{"$error":"#N/A"},{"$error":"#N/A"},{"$error":"#N/A"},{"$error":"#N/A"},237.39999999999506,{"$error":"#N/A"},{"$error":"#N/A"},{"$error":"#N/A"}]
[{"$nulls":5},{"$f":"IF(F1190<$I$2,F1190+30,NA())","v":{"$error":"#N/A"}},{"$f":"G1190+$G$2","v":237.59999999999505},{"$f":"-1+COS(F1191*PI()/180)+G1191","v":{"$error":"#N/A"}},{"$f":"(F1191/$I$2)*($D$8-$D$7)+COS(F1191*PI()/180)+$D$7-1","v":{"$error":"#N/A"}},{"$f":"$J$2*SIN(F1191*PI()/180)+$B$18","v":{"$error":"#N/A"}},{"$error":"#N/A"},237.59999999999505,{"$f":"-1+COS(K1191*PI()/180)+L1191","v":{"$error":"#N/A"}},{"$f":"(K1191/$N$2)*($D$13-$D$12)+COS(K1191*PI()/180)+$D$12-1","v":{"$error":"#N/A"}},{"$f":"$O$2*SIN(K1191*PI()/180)+$B$19","v":{"$error":"#N/A"}},{"$error":"#N/A"},{"$f":"Q1190+$G$2","v":237.59999999999505},{"$f":"-1+COS(P1191*PI()/180)+Q1191","v":{"$error":"#N/A"}},{"$f":"(P1191/$S$2)*($D$18-$D$17)+COS(P1191*PI()/180)+$D$17-1","v":{"$error":"#N/A"}},{"$f":"$T$2*SIN(P1191*PI()/180)+$B$20","v":{"$error":"#N/A"}}]
[{"$nulls":5},{"$error":"#N/A"},237.79999999999504,{"$error":"#N/A"},{"$error":"#N/A"},{"$error":"#N/A"},{"$error":"#N/A"},237.79999999999504,{"$error":"#N/A"},{"$error":"#N/A"},{"$error":"#N/A"},{"$error":"#N/A"},237.79999999999504,{"$error":"#N/A"},{"$error":"#N/A"},{"$error":"#N/A"}]
[{"$nulls":5},{"$error":"#N/A"},237.99999999999503,{"$error":"#N/A"},{"$error":"#N/A"},{"$error":"#N/A"},{"$error":"#N/A"},237.99999999999503,{"$error":"#N/A"},{"$error":"#N/A"},{"$error":"#N/A"},{"$error":"#N/A"},237.99999999999503,{"$error":"#N/A"},{"$error":"#N/A"},{"$error":"#N/A"}]
[{"$nulls":5},{"$error":"#N/A"},238.19999999999501,{"$error":"#N/A"},{"$error":"#N/A"},{"$error":"#N/A"},{"$error":"#N/A"},238.19999999999501,{"$error":"#N/A"},{"$error":"#N/A"},{"$error":"#N/A"},{"$error":"#N/A"},238.19999999999501,{"$error":"#N/A"},{"$error":"#N/A"},{"$error":"#N/A"}]
[{"$nulls":5},{"$error":"#N/A"},238.399999999995,{"$error":"#N/A"},{"$error":"#N/A"},{"$error":"#N/A"},{"$error":"#N/A"},238.399999999995,{"$error":"#N/A"},{"$error":"#N/A"},{"$error":"#N/A"},{"$error":"#N/A"},238.399999999995,{"$error":"#N/A"},{"$error":"#N/A"},{"$error":"#N/A"}]
[{"$nulls":5},{"$error":"#N/A"},238.599999999995,{"$error":"#N/A"},{"$error":"#N/A"},{"$error":"#N/A"},{"$error":"#N/A"},238.599999999995,{"$error":"#N/A"},{"$error":"#N/A"},{"$error":"#N/A"},{"$error":"#N/A"},238.599999999995,{"$error":"#N/A"},{"$error":"#N/A"},{"$error":"#N/A"}]
[{"$nulls":5},{"$error":"#N/A"},238.79999999999498,{"$error":"#N/A"},{"$error":"#N/A"},{"$error":"#N/A"},{"$error":"#N/A"},238.79999999999498,{"$error":"#N/A"},{"$error":"#N/A"},{"$error":"#N/A"},{"$error":"#N/A"},238.79999999999498,{"$error":"#N/A"},{"$error":"#N/A"},{"$error":"#N/A"}]
[{"$nulls":5},{"$error":"#N/A"},238.99999999999497,{"$error":"#N/A"},{"$error":"#N/A"},{"$error":"#N/A"},{"$error":"#N/A"},238.99999999999497,{"$error":"#N/A"},{"$error":"#N/A"},{"$error":"#N/A"},{"$error":"#N/A"},238.99999999999497,{"$error":"#N/A"},{"$error":"#N/A"},{"$error":"#N/A"}]
[{"$nulls":5},{"$error":"#N/A"},239.19999999999496,{"$error":"#N/A"},{"$error":"#N/A"},{"$error":"#N/A"},{"$error":"#N/A"},239.19999999999496,{"$error":"#N/A"},{"$error":"#N/A"},{"$error":"#N/A"},{"$error":"#N/A"},239.19999999999496,{"$error":"#N/A"},{"$error":"#N/A"},{"$error":"#N/A"}]
[{"$nulls":5},{"$error":"#N/A"},239.39999999999495,{"$error":"#N/A"},{"$error":"#N/A"},{"$error":"#N/A"},{"$error":"#N/A"},239.39999999999495,{"$error":"#N/A"},{"$error":"#N/A"},{"$error":"#N/A"},{"$error":"#N/A"},239.39999999999495,{"$error":"#N/A"},{"$error":"#N/A"},{"$error":"#N/A"}]
[{"$nulls":5},{"$error":"#N/A"},239.59999999999494,{"$error":"#N/A"},{"$error":"#N/A"},{"$error":"#N/A"},{"$error":"#N/A"},239.59999999999494,{"$error":"#N/A"},{"$error":"#N/A"},{"$error":"#N/A"},{"$error":"#N/A"},239.59999999999494,{"$error":"#N/A"},{"$error":"#N/A"},{"$error":"#N/A"}]
[{"$nulls":5},{"$error":"#N/A"},239.79999999999492,{"$error":"#N/A"},{"$error":"#N/A"},{"$error":"#N/A"},{"$error":"#N/A"},239.79999999999492,{"$error":"#N/A"},{"$error":"#N/A"},{"$error":"#N/A"},{"$error":"#N/A"},239.79999999999492,{"$error":"#N/A"},{"$error":"#N/A"},{"$error":"#N/A"}]
[{"$nulls":5},{"$error":"#N/A"},239.9999999999949,{"$error":"#N/A"},{"$error":"#N/A"},{"$error":"#N/A"},{"$error":"#N/A"},239.9999999999949,{"$error":"#N/A"},{"$error":"#N/A"},{"$error":"#N/A"},{"$error":"#N/A"},239.9999999999949,{"$error":"#N/A"},{"$error":"#N/A"},{"$error":"#N/A"}]